{"text_format":"1","workbook":"xlsx","n_sheets":6,"sheets":["Intro","Summary","1_Původní","2_Upravený","3_Rozdíly","CisNS"],"not_rendered":{"charts":0,"images":2,"macros":1,"external_links":0,"defined_names":1,"comments":0,"pivot_tables":0},"unopened":[],"bounds":{"document_bytes":16777216,"sheet_cells":100000,"rows_first":2000,"rows_last":500,"rows_between":2000,"halvings":0,"cell_chars":16384,"cell_head_chars":4096},"cells_cut":0,"cells_raw":0,"read":"whole","date_system":"1900"}

{"sheet":"Intro","index":0,"n_rows":5,"n_cols":2,"rows_kept":5,"cut":false,"hidden":false,"merged":[]}
[]
[null,"Pro správnou funkčnost šablony je zapotřebí povolit makra."]
[null,"A jelikož nemáte makra povolená, zobrazuje se tento list."]
[null,"Makra povolíte v menu Soubor/Možnosti/Centrum zabezpečení/Nastavení centra zabezpečení/ Nastavení maker a zaškrtněte volbu Povolit všechny makra"]
[null,"Po povolení maker šablonu zavřete a otevřete znovu."]

{"sheet":"Summary","index":1,"n_rows":17,"n_cols":7,"rows_kept":17,"cut":false,"hidden":true,"merged":[[7,3,7,5],[7,1,8,2],[14,1,15,2],[14,3,15,3]]}
[null,null,null,null,null,null,{"$f":"SUM(F:F)","v":0}]
[null,"Plánovací proces 2021 - šablona pro úpravu návrhu rozpočtu analytického účtu do středisek a měsíců"]
[]
[null,"Garant","OIN"]
[null,"Jméno","Ing. František Valíček"]
[null,"Email","Frantisek.Valicek@fnol.cz"]
[]
[null,"Analytický účet",null,"Rozpočet"]
[null,null,null,"1_Původní","2_Upravený","3_Rozdíly"]
[null,51805001,"Průzkumné a projektové práce",{"$f":"IFERROR(VLOOKUP(B10,'1_Původní'!A:P,16,FALSE),0)","v":499999.99999999994},{"$f":"IFERROR(VLOOKUP(B10,'2_Upravený'!A:P,16,FALSE),0)","v":499999.99999199988},{"$f":"ROUND(E10-D10,0)","v":0}]
[null,51874001,"Ostatní služby - provozní",{"$f":"IFERROR(VLOOKUP(B11,'1_Původní'!A:P,16,FALSE),0)","v":11051000.000299999},{"$f":"IFERROR(VLOOKUP(B11,'2_Upravený'!A:P,16,FALSE),0)","v":11050999.999995448},{"$f":"ROUND(E11-D11,0)","v":0}]
[]
[null,null,null,null,null,{"$f":"ROUND(SUM(F10:F11),0)","v":0}]
[]
[null,"Přehled plánovaných rezerv za garanta"]
[null,null,null,null,null,{"$f":"IF(COUNTIF('2_Upravený'!$Q:$Q,\"Obrat bez specifikace NS\")>0,COUNTIF('2_Upravený'!$Q:$Q,\"Obrat bez specifikace NS\"),\"\")","v":""}]
[null,"Bez rezerv",null,null,{"$f":"IF($F$16=\"\",\"\",\"Obrat\")","v":""},{"$f":"IF(COUNTIF('2_Upravený'!$Q:$Q,\"Obrat bez specifikace NS\")>0,SUMIF('2_Upravený'!$Q:$Q,\"Obrat bez specifikace NS\",'2_Upravený'!$P:$P),\"\")","v":""}]

{"sheet":"1_Původní","index":2,"n_rows":97,"n_cols":16,"rows_kept":97,"cut":false,"hidden":true,"merged":[]}
["Legenda",null,"Hodnoty v CZK"]
["Účet","Název účtu"]
[null,"NS","Název NS",202001,202002,202003,202004,202005,202006,202007,202008,202009,202010,202011,202012,"2020 celkem"]
[]
[51805001,"Průzkumné a projektové práce",null,{"$f":"SUM(D6:D32)","v":47133.259600000005},9722.7374,7750.4105999999992,30075.055400000001,34207.965000000004,71881.6783,34896.706600000005,76484.309599999993,13167.364300000001,47093.633800000003,68552.989399999991,59033.89,499999.99999999994]
[null,"0111","Lůžkové oddělení 1",6767.0252,0,0,0,0,0,0,0,0,0,0,0,{"$f":"SUM(D6:O6)","v":6767.0252}]
[null,"0301","Vedení klinického pracoviště",0,0,0,0,0,277.79250000000002,0,0,0,0,0,0,{"$f":"SUM(D7:O7)","v":277.79250000000002}]
[null,"0811","Lůžkové oddělení 19B (šestinedělí)",0,0,0,23417.218700000001,0,0,0,0,0,0,0,0,23417.218700000001]
[null,"0832","JIP 19 (porodní sál)",6250.3311999999996,0,0,0,0,0,0,0,0,0,0,0,6250.3311999999996]
[null,"0862","Porodní sál - lokální",0,0,0,0,0,0,0,0,0,0,0,11938.189899999999,11938.189899999999]
[null,"0863","Operační sál OP 17 (z 08 62)",2222.34,0,0,0,0,0,0,0,0,0,0,0,2222.34]
[null,"0931","JIP 16A +16D",0,0,0,0,10444.9979,0,0,0,0,0,0,0,10444.9979]
[null,"1001","Vedení klinického pracoviště",0,0,0,0,0,277.79250000000002,0,0,0,0,0,0,277.79250000000002]
[null,"1012","Lůžkové oddělení 28C vč.dospávací haly",0,0,0,0,7778.1899000000003,0,0,0,0,0,0,0,7778.1899000000003]
[null,"1121","Ambulance",0,0,0,0,0,0,0,10833.9074,0,0,0,0,10833.9074]
[null,"1162","Operační sál - lokální",0,0,0,0,0,0,0,10000.5299,0,0,0,0,10000.5299]
[null,"1211","Lůžkové oddělení",0,0,0,0,534.00440000000003,0,0,0,0,0,0,0,534.00440000000003]
[null,"1321","Ambulance",0,0,0,0,0,0,0,9028.2561000000005,0,0,0,0,9028.2561000000005]
[null,"1462","Operační sál - lokální",6944.8123999999998,0,0,0,0,0,0,0,0,0,0,0,6944.8123999999998]
[null,"1721","Ambulance",9056.0354000000007,0,0,0,0,0,0,0,0,0,0,0,9056.0354000000007]
{"$rows_left_out":78}
{"sheet":"2_Upravený","index":3,"n_rows":100,"n_cols":21,"rows_kept":100,"cut":false,"hidden":true,"merged":[[0,16,1,16]]}
["Legenda",null,"Hodnoty v CZK",null,null,null,null,null,null,null,null,null,null,null,null,null,"Rozdíl"]
["Účet","Název účtu"]
[null,"NS","Název NS",202001,202002,202003,202004,202005,202006,202007,202008,202009,202010,202011,202012,"2020 celkem",{"$f":"SUM(Q4:Q33)","v":0}]
[]
[51805001,"Průzkumné a projektové práce",null,{"$f":"SUM(D6:D32)","v":41666.666665999997},41666.666665999997,41666.666665999997,41666.666665999997,41666.666665999997,41666.666665999997,41666.666665999997,41666.666665999997,41666.666665999997,41666.666665999997,41666.666665999997,41666.666665999997,499999.99999199988,{"$f":"ROUND(P5-SUMIF('1_Původní'!A:A,'2_Upravený'!A5,'1_Původní'!P:P),0)","v":0}]
[null,"0111","Lůžkové oddělení 1",0,0,0,0,0,0,0,0,0,0,0,0,{"$f":"SUM(D6:O6)","v":0},{"$f":"IF(AND(ROUND(P6,0)<>0,B6=\"\"),\"Obrat bez specifikace NS\",\"\")","v":""},null,"Orig",{"$f":"$A$5","v":51805001}]
[null,"0301","Vedení klinického pracoviště",0,0,0,0,0,0,0,0,0,0,0,0,{"$f":"SUM(D7:O7)","v":0},{"$f":"IF(AND(ROUND(P7,0)<>0,B7=\"\"),\"Obrat bez specifikace NS\",\"\")","v":""},null,"Orig",{"$f":"$A$5","v":51805001}]
[null,"0811","Lůžkové oddělení 19B (šestinedělí)",0,0,0,0,0,0,0,0,0,0,0,0,0,"",null,"Orig",51805001]
[null,"0832","JIP 19 (porodní sál)",0,0,0,0,0,0,0,0,0,0,0,0,0,"",null,"Orig",51805001]
[null,"0862","Porodní sál - lokální",0,0,0,0,0,0,0,0,0,0,0,0,0,"",null,"Orig",51805001]
[null,"0863","Operační sál OP 17 (z 08 62)",0,0,0,0,0,0,0,0,0,0,0,0,0,"",null,"Orig",51805001]
[null,"0931","JIP 16A +16D",0,0,0,0,0,0,0,0,0,0,0,0,0,"",null,"Orig",51805001]
[null,"1001","Vedení klinického pracoviště",0,0,0,0,0,0,0,0,0,0,0,0,0,"",null,"Orig",51805001]
[null,"1012","Lůžkové oddělení 28C vč.dospávací haly",0,0,0,0,0,0,0,0,0,0,0,0,0,"",null,"Orig",51805001]
[null,"1121","Ambulance",0,0,0,0,0,0,0,0,0,0,0,0,0,"",null,"Orig",51805001]
[null,"1162","Operační sál - lokální",0,0,0,0,0,0,0,0,0,0,0,0,0,"",null,"Orig",51805001]
[null,"1211","Lůžkové oddělení",0,0,0,0,0,0,0,0,0,0,0,0,0,"",null,"Orig",51805001]
[null,"1321","Ambulance",0,0,0,0,0,0,0,0,0,0,0,0,0,"",null,"Orig",51805001]
[null,"1462","Operační sál - lokální",0,0,0,0,0,0,0,0,0,0,0,0,0,"",null,"Orig",51805001]
[null,"1721","Ambulance",0,0,0,0,0,0,0,0,0,0,0,0,0,"",null,"Orig",51805001]
{"$rows_left_out":81}
{"sheet":"3_Rozdíly","index":4,"n_rows":100,"n_cols":16,"rows_kept":100,"cut":false,"hidden":true,"merged":[]}
["Legenda",null,"Hodnoty v CZK"]
["Účet","Název účtu"]
[null,"NS","Název NS",202001,202002,202003,202004,202005,202006,202007,202008,202009,202010,202011,202012,"2020 celkem"]
[]
[51805001,"Průzkumné a projektové práce",null,{"$f":"SUM(D32:D32)","v":0},0,0,0,0,0,0,0,0,0,0,0,0]
[null,{"$f":"IF('2_Upravený'!B6=\"\",\"\",'2_Upravený'!B6)","v":"0111"},{"$f":"IF('2_Upravený'!C6=\"\",\"\",'2_Upravený'!C6)","v":"Lůžkové oddělení 1"},{"$f":"'2_Upravený'!D6-'1_Původní'!D6","v":-6767.0252},{"$f":"'2_Upravený'!E6-'1_Původní'!E6","v":0},{"$f":"'2_Upravený'!F6-'1_Původní'!F6","v":0},{"$f":"'2_Upravený'!G6-'1_Původní'!G6","v":0},{"$f":"'2_Upravený'!H6-'1_Původní'!H6","v":0},{"$f":"'2_Upravený'!I6-'1_Původní'!I6","v":0},{"$f":"'2_Upravený'!J6-'1_Původní'!J6","v":0},{"$f":"'2_Upravený'!K6-'1_Původní'!K6","v":0},{"$f":"'2_Upravený'!L6-'1_Původní'!L6","v":0},{"$f":"'2_Upravený'!M6-'1_Původní'!M6","v":0},{"$f":"'2_Upravený'!N6-'1_Původní'!N6","v":0},{"$f":"'2_Upravený'!O6-'1_Původní'!O6","v":0},{"$f":"SUM(D6:O6)","v":-6767.0252}]
[null,{"$f":"IF('2_Upravený'!B7=\"\",\"\",'2_Upravený'!B7)","v":"0301"},{"$f":"IF('2_Upravený'!C7=\"\",\"\",'2_Upravený'!C7)","v":"Vedení klinického pracoviště"},{"$f":"'2_Upravený'!D7-'1_Původní'!D7","v":0},{"$f":"'2_Upravený'!E7-'1_Původní'!E7","v":0},{"$f":"'2_Upravený'!F7-'1_Původní'!F7","v":0},{"$f":"'2_Upravený'!G7-'1_Původní'!G7","v":0},{"$f":"'2_Upravený'!H7-'1_Původní'!H7","v":0},{"$f":"'2_Upravený'!I7-'1_Původní'!I7","v":-277.79250000000002},{"$f":"'2_Upravený'!J7-'1_Původní'!J7","v":0},{"$f":"'2_Upravený'!K7-'1_Původní'!K7","v":0},{"$f":"'2_Upravený'!L7-'1_Původní'!L7","v":0},{"$f":"'2_Upravený'!M7-'1_Původní'!M7","v":0},{"$f":"'2_Upravený'!N7-'1_Původní'!N7","v":0},{"$f":"'2_Upravený'!O7-'1_Původní'!O7","v":0},{"$f":"SUM(D7:O7)","v":-277.79250000000002}]
[null,{"$f":"IF('2_Upravený'!B8=\"\",\"\",'2_Upravený'!B8)","v":"0811"},{"$f":"IF('2_Upravený'!C8=\"\",\"\",'2_Upravený'!C8)","v":"Lůžkové oddělení 19B (šestinedělí)"},{"$f":"'2_Upravený'!D8-'1_Původní'!D8","v":0},{"$f":"'2_Upravený'!E8-'1_Původní'!E8","v":0},{"$f":"'2_Upravený'!F8-'1_Původní'!F8","v":0},{"$f":"'2_Upravený'!G8-'1_Původní'!G8","v":-23417.218700000001},{"$f":"'2_Upravený'!H8-'1_Původní'!H8","v":0},{"$f":"'2_Upravený'!I8-'1_Původní'!I8","v":0},{"$f":"'2_Upravený'!J8-'1_Původní'!J8","v":0},{"$f":"'2_Upravený'!K8-'1_Původní'!K8","v":0},{"$f":"'2_Upravený'!L8-'1_Původní'!L8","v":0},{"$f":"'2_Upravený'!M8-'1_Původní'!M8","v":0},{"$f":"'2_Upravený'!N8-'1_Původní'!N8","v":0},{"$f":"'2_Upravený'!O8-'1_Původní'!O8","v":0},-23417.218700000001]
[null,{"$f":"IF('2_Upravený'!B9=\"\",\"\",'2_Upravený'!B9)","v":"0832"},{"$f":"IF('2_Upravený'!C9=\"\",\"\",'2_Upravený'!C9)","v":"JIP 19 (porodní sál)"},{"$f":"'2_Upravený'!D9-'1_Původní'!D9","v":-6250.3311999999996},{"$f":"'2_Upravený'!E9-'1_Původní'!E9","v":0},{"$f":"'2_Upravený'!F9-'1_Původní'!F9","v":0},{"$f":"'2_Upravený'!G9-'1_Původní'!G9","v":0},{"$f":"'2_Upravený'!H9-'1_Původní'!H9","v":0},{"$f":"'2_Upravený'!I9-'1_Původní'!I9","v":0},{"$f":"'2_Upravený'!J9-'1_Původní'!J9","v":0},{"$f":"'2_Upravený'!K9-'1_Původní'!K9","v":0},{"$f":"'2_Upravený'!L9-'1_Původní'!L9","v":0},{"$f":"'2_Upravený'!M9-'1_Původní'!M9","v":0},{"$f":"'2_Upravený'!N9-'1_Původní'!N9","v":0},{"$f":"'2_Upravený'!O9-'1_Původní'!O9","v":0},-6250.3311999999996]
[null,{"$f":"IF('2_Upravený'!B10=\"\",\"\",'2_Upravený'!B10)","v":"0862"},{"$f":"IF('2_Upravený'!C10=\"\",\"\",'2_Upravený'!C10)","v":"Porodní sál - lokální"},{"$f":"'2_Upravený'!D10-'1_Původní'!D10","v":0},{"$f":"'2_Upravený'!E10-'1_Původní'!E10","v":0},{"$f":"'2_Upravený'!F10-'1_Původní'!F10","v":0},{"$f":"'2_Upravený'!G10-'1_Původní'!G10","v":0},{"$f":"'2_Upravený'!H10-'1_Původní'!H10","v":0},{"$f":"'2_Upravený'!I10-'1_Původní'!I10","v":0},{"$f":"'2_Upravený'!J10-'1_Původní'!J10","v":0},{"$f":"'2_Upravený'!K10-'1_Původní'!K10","v":0},{"$f":"'2_Upravený'!L10-'1_Původní'!L10","v":0},{"$f":"'2_Upravený'!M10-'1_Původní'!M10","v":0},{"$f":"'2_Upravený'!N10-'1_Původní'!N10","v":0},{"$f":"'2_Upravený'!O10-'1_Původní'!O10","v":-11938.189899999999},-11938.189899999999]
[null,{"$f":"IF('2_Upravený'!B11=\"\",\"\",'2_Upravený'!B11)","v":"0863"},{"$f":"IF('2_Upravený'!C11=\"\",\"\",'2_Upravený'!C11)","v":"Operační sál OP 17 (z 08 62)"},{"$f":"'2_Upravený'!D11-'1_Původní'!D11","v":-2222.34},{"$f":"'2_Upravený'!E11-'1_Původní'!E11","v":0},{"$f":"'2_Upravený'!F11-'1_Původní'!F11","v":0},{"$f":"'2_Upravený'!G11-'1_Původní'!G11","v":0},{"$f":"'2_Upravený'!H11-'1_Původní'!H11","v":0},{"$f":"'2_Upravený'!I11-'1_Původní'!I11","v":0},{"$f":"'2_Upravený'!J11-'1_Původní'!J11","v":0},{"$f":"'2_Upravený'!K11-'1_Původní'!K11","v":0},{"$f":"'2_Upravený'!L11-'1_Původní'!L11","v":0},{"$f":"'2_Upravený'!M11-'1_Původní'!M11","v":0},{"$f":"'2_Upravený'!N11-'1_Původní'!N11","v":0},{"$f":"'2_Upravený'!O11-'1_Původní'!O11","v":0},-2222.34]
[null,{"$f":"IF('2_Upravený'!B12=\"\",\"\",'2_Upravený'!B12)","v":"0931"},{"$f":"IF('2_Upravený'!C12=\"\",\"\",'2_Upravený'!C12)","v":"JIP 16A +16D"},{"$f":"'2_Upravený'!D12-'1_Původní'!D12","v":0},{"$f":"'2_Upravený'!E12-'1_Původní'!E12","v":0},{"$f":"'2_Upravený'!F12-'1_Původní'!F12","v":0},{"$f":"'2_Upravený'!G12-'1_Původní'!G12","v":0},{"$f":"'2_Upravený'!H12-'1_Původní'!H12","v":-10444.9979},{"$f":"'2_Upravený'!I12-'1_Původní'!I12","v":0},{"$f":"'2_Upravený'!J12-'1_Původní'!J12","v":0},{"$f":"'2_Upravený'!K12-'1_Původní'!K12","v":0},{"$f":"'2_Upravený'!L12-'1_Původní'!L12","v":0},{"$f":"'2_Upravený'!M12-'1_Původní'!M12","v":0},{"$f":"'2_Upravený'!N12-'1_Původní'!N12","v":0},{"$f":"'2_Upravený'!O12-'1_Původní'!O12","v":0},-10444.9979]
[null,{"$f":"IF('2_Upravený'!B13=\"\",\"\",'2_Upravený'!B13)","v":"1001"},{"$f":"IF('2_Upravený'!C13=\"\",\"\",'2_Upravený'!C13)","v":"Vedení klinického pracoviště"},{"$f":"'2_Upravený'!D13-'1_Původní'!D13","v":0},{"$f":"'2_Upravený'!E13-'1_Původní'!E13","v":0},{"$f":"'2_Upravený'!F13-'1_Původní'!F13","v":0},{"$f":"'2_Upravený'!G13-'1_Původní'!G13","v":0},{"$f":"'2_Upravený'!H13-'1_Původní'!H13","v":0},{"$f":"'2_Upravený'!I13-'1_Původní'!I13","v":-277.79250000000002},{"$f":"'2_Upravený'!J13-'1_Původní'!J13","v":0},{"$f":"'2_Upravený'!K13-'1_Původní'!K13","v":0},{"$f":"'2_Upravený'!L13-'1_Původní'!L13","v":0},{"$f":"'2_Upravený'!M13-'1_Původní'!M13","v":0},{"$f":"'2_Upravený'!N13-'1_Původní'!N13","v":0},{"$f":"'2_Upravený'!O13-'1_Původní'!O13","v":0},-277.79250000000002]
[null,{"$f":"IF('2_Upravený'!B14=\"\",\"\",'2_Upravený'!B14)","v":"1012"},{"$f":"IF('2_Upravený'!C14=\"\",\"\",'2_Upravený'!C14)","v":"Lůžkové oddělení 28C vč.dospávací haly"},{"$f":"'2_Upravený'!D14-'1_Původní'!D14","v":0},{"$f":"'2_Upravený'!E14-'1_Původní'!E14","v":0},{"$f":"'2_Upravený'!F14-'1_Původní'!F14","v":0},{"$f":"'2_Upravený'!G14-'1_Původní'!G14","v":0},{"$f":"'2_Upravený'!H14-'1_Původní'!H14","v":-7778.1899000000003},{"$f":"'2_Upravený'!I14-'1_Původní'!I14","v":0},{"$f":"'2_Upravený'!J14-'1_Původní'!J14","v":0},{"$f":"'2_Upravený'!K14-'1_Původní'!K14","v":0},{"$f":"'2_Upravený'!L14-'1_Původní'!L14","v":0},{"$f":"'2_Upravený'!M14-'1_Původní'!M14","v":0},{"$f":"'2_Upravený'!N14-'1_Původní'!N14","v":0},{"$f":"'2_Upravený'!O14-'1_Původní'!O14","v":0},-7778.1899000000003]
[null,{"$f":"IF('2_Upravený'!B15=\"\",\"\",'2_Upravený'!B15)","v":"1121"},{"$f":"IF('2_Upravený'!C15=\"\",\"\",'2_Upravený'!C15)","v":"Ambulance"},{"$f":"'2_Upravený'!D15-'1_Původní'!D15","v":0},{"$f":"'2_Upravený'!E15-'1_Původní'!E15","v":0},{"$f":"'2_Upravený'!F15-'1_Původní'!F15","v":0},{"$f":"'2_Upravený'!G15-'1_Původní'!G15","v":0},{"$f":"'2_Upravený'!H15-'1_Původní'!H15","v":0},{"$f":"'2_Upravený'!I15-'1_Původní'!I15","v":0},{"$f":"'2_Upravený'!J15-'1_Původní'!J15","v":0},{"$f":"'2_Upravený'!K15-'1_Původní'!K15","v":-10833.9074},{"$f":"'2_Upravený'!L15-'1_Původní'!L15","v":0},{"$f":"'2_Upravený'!M15-'1_Původní'!M15","v":0},{"$f":"'2_Upravený'!N15-'1_Původní'!N15","v":0},{"$f":"'2_Upravený'!O15-'1_Původní'!O15","v":0},-10833.9074]
[null,{"$f":"IF('2_Upravený'!B16=\"\",\"\",'2_Upravený'!B16)","v":"1162"},{"$f":"IF('2_Upravený'!C16=\"\",\"\",'2_Upravený'!C16)","v":"Operační sál - lokální"},{"$f":"'2_Upravený'!D16-'1_Původní'!D16","v":0},{"$f":"'2_Upravený'!E16-'1_Původní'!E16","v":0},{"$f":"'2_Upravený'!F16-'1_Původní'!F16","v":0},{"$f":"'2_Upravený'!G16-'1_Původní'!G16","v":0},{"$f":"'2_Upravený'!H16-'1_Původní'!H16","v":0},{"$f":"'2_Upravený'!I16-'1_Původní'!I16","v":0},{"$f":"'2_Upravený'!J16-'1_Původní'!J16","v":0},{"$f":"'2_Upravený'!K16-'1_Původní'!K16","v":-10000.5299},{"$f":"'2_Upravený'!L16-'1_Původní'!L16","v":0},{"$f":"'2_Upravený'!M16-'1_Původní'!M16","v":0},{"$f":"'2_Upravený'!N16-'1_Původní'!N16","v":0},{"$f":"'2_Upravený'!O16-'1_Původní'!O16","v":0},-10000.5299]
[null,{"$f":"IF('2_Upravený'!B17=\"\",\"\",'2_Upravený'!B17)","v":"1211"},{"$f":"IF('2_Upravený'!C17=\"\",\"\",'2_Upravený'!C17)","v":"Lůžkové oddělení"},{"$f":"'2_Upravený'!D17-'1_Původní'!D17","v":0},{"$f":"'2_Upravený'!E17-'1_Původní'!E17","v":0},{"$f":"'2_Upravený'!F17-'1_Původní'!F17","v":0},{"$f":"'2_Upravený'!G17-'1_Původní'!G17","v":0},{"$f":"'2_Upravený'!H17-'1_Původní'!H17","v":-534.00440000000003},{"$f":"'2_Upravený'!I17-'1_Původní'!I17","v":0},{"$f":"'2_Upravený'!J17-'1_Původní'!J17","v":0},{"$f":"'2_Upravený'!K17-'1_Původní'!K17","v":0},{"$f":"'2_Upravený'!L17-'1_Původní'!L17","v":0},{"$f":"'2_Upravený'!M17-'1_Původní'!M17","v":0},{"$f":"'2_Upravený'!N17-'1_Původní'!N17","v":0},{"$f":"'2_Upravený'!O17-'1_Původní'!O17","v":0},-534.00440000000003]
[null,{"$f":"IF('2_Upravený'!B18=\"\",\"\",'2_Upravený'!B18)","v":"1321"},{"$f":"IF('2_Upravený'!C18=\"\",\"\",'2_Upravený'!C18)","v":"Ambulance"},{"$f":"'2_Upravený'!D18-'1_Původní'!D18","v":0},{"$f":"'2_Upravený'!E18-'1_Původní'!E18","v":0},{"$f":"'2_Upravený'!F18-'1_Původní'!F18","v":0},{"$f":"'2_Upravený'!G18-'1_Původní'!G18","v":0},{"$f":"'2_Upravený'!H18-'1_Původní'!H18","v":0},{"$f":"'2_Upravený'!I18-'1_Původní'!I18","v":0},{"$f":"'2_Upravený'!J18-'1_Původní'!J18","v":0},{"$f":"'2_Upravený'!K18-'1_Původní'!K18","v":-9028.2561000000005},{"$f":"'2_Upravený'!L18-'1_Původní'!L18","v":0},{"$f":"'2_Upravený'!M18-'1_Původní'!M18","v":0},{"$f":"'2_Upravený'!N18-'1_Původní'!N18","v":0},{"$f":"'2_Upravený'!O18-'1_Původní'!O18","v":0},-9028.2561000000005]
[null,{"$f":"IF('2_Upravený'!B19=\"\",\"\",'2_Upravený'!B19)","v":"1462"},{"$f":"IF('2_Upravený'!C19=\"\",\"\",'2_Upravený'!C19)","v":"Operační sál - lokální"},{"$f":"'2_Upravený'!D19-'1_Původní'!D19","v":-6944.8123999999998},{"$f":"'2_Upravený'!E19-'1_Původní'!E19","v":0},{"$f":"'2_Upravený'!F19-'1_Původní'!F19","v":0},{"$f":"'2_Upravený'!G19-'1_Původní'!G19","v":0},{"$f":"'2_Upravený'!H19-'1_Původní'!H19","v":0},{"$f":"'2_Upravený'!I19-'1_Původní'!I19","v":0},{"$f":"'2_Upravený'!J19-'1_Původní'!J19","v":0},{"$f":"'2_Upravený'!K19-'1_Původní'!K19","v":0},{"$f":"'2_Upravený'!L19-'1_Původní'!L19","v":0},{"$f":"'2_Upravený'!M19-'1_Původní'!M19","v":0},{"$f":"'2_Upravený'!N19-'1_Původní'!N19","v":0},{"$f":"'2_Upravený'!O19-'1_Původní'!O19","v":0},-6944.8123999999998]
[null,{"$f":"IF('2_Upravený'!B20=\"\",\"\",'2_Upravený'!B20)","v":"1721"},{"$f":"IF('2_Upravený'!C20=\"\",\"\",'2_Upravený'!C20)","v":"Ambulance"},{"$f":"'2_Upravený'!D20-'1_Původní'!D20","v":-9056.0354000000007},{"$f":"'2_Upravený'!E20-'1_Původní'!E20","v":0},{"$f":"'2_Upravený'!F20-'1_Původní'!F20","v":0},{"$f":"'2_Upravený'!G20-'1_Původní'!G20","v":0},{"$f":"'2_Upravený'!H20-'1_Původní'!H20","v":0},{"$f":"'2_Upravený'!I20-'1_Původní'!I20","v":0},{"$f":"'2_Upravený'!J20-'1_Původní'!J20","v":0},{"$f":"'2_Upravený'!K20-'1_Původní'!K20","v":0},{"$f":"'2_Upravený'!L20-'1_Původní'!L20","v":0},{"$f":"'2_Upravený'!M20-'1_Původní'!M20","v":0},{"$f":"'2_Upravený'!N20-'1_Původní'!N20","v":0},{"$f":"'2_Upravený'!O20-'1_Původní'!O20","v":0},-9056.0354000000007]
{"$rows_left_out":81}
{"sheet":"CisNS","index":5,"n_rows":1042,"n_cols":2,"rows_kept":1042,"cut":false,"hidden":true,"merged":[]}
["pracv","pracvt"]
["0101","Vedení klinického pracoviště"]
["0102",""]
["0103",""]
["0104","OP - Interaktivní kardiologie-moderní výukové metody"]
["0107","IOP- Mod.obn.přistr.vyb.komplex.kardiovas.centra"]
["0111","Lůžkové oddělení 1 "]
["0112","Lůžkové oddělení"]
["0113","Lůžkové oddělení 4 "]
["0115","Lůžkové oddělení ECMO"]
["0116","Lůžkové oddělení COVID 19"]
["0117","1IK: lůžkové oddělení"]
["0121","Ambulance"]
["0122","Ambulance - PAH "]
["0123","Ambulance"]
["0124","Ambulance"]
["0131","JIP "]
["0171","Odd. invaz. vyš. metod-kardiovertery"]
["0172","Katetrizační sál"]
["0176","IROP - Návazná péče"]
{"$rows_left_out":1022}