{"text_format":"1","workbook":"xlsx","n_sheets":6,"sheets":["Intro","Summary","1_Původní","2_Upravený","3_Rozdíly","CisNS"],"not_rendered":{"charts":0,"images":2,"macros":1,"external_links":0,"defined_names":1,"comments":0,"pivot_tables":0},"unopened":[],"bounds":{"document_bytes":16777216,"sheet_cells":100000,"rows_first":2000,"rows_last":500,"rows_between":2000,"halvings":0,"cell_chars":16384,"cell_head_chars":4096},"cells_cut":0,"cells_raw":0,"read":"whole","date_system":"1900"}

{"sheet":"Intro","index":0,"n_rows":5,"n_cols":2,"rows_kept":5,"cut":false,"hidden":false,"merged":[]}
[]
[null,"Pro správnou funkčnost šablony je zapotřebí povolit makra."]
[null,"A jelikož nemáte makra povolená, zobrazuje se tento list."]
[null,"Makra povolíte v menu Soubor/Možnosti/Centrum zabezpečení/Nastavení centra zabezpečení/ Nastavení maker a zaškrtněte volbu Povolit všechny makra"]
[null,"Po povolení maker šablonu zavřete a otevřete znovu."]

{"sheet":"Summary","index":1,"n_rows":17,"n_cols":7,"rows_kept":17,"cut":false,"hidden":true,"merged":[[7,3,7,5],[7,1,8,2],[14,1,15,2],[14,3,15,3]]}
[null,null,null,null,null,null,{"$f":"SUM(F:F)","v":0}]
[null,"Plánovací proces 2021 - šablona pro úpravu návrhu rozpočtu analytického účtu do středisek a měsíců"]
[]
[null,"Garant","OIN"]
[null,"Jméno","Ing. František Valíček"]
[null,"Email","Frantisek.Valicek@fnol.cz"]
[]
[null,"Analytický účet",null,"Rozpočet"]
[null,null,null,"1_Původní","2_Upravený","3_Rozdíly"]
[null,51805001,"Průzkumné a projektové práce",{"$f":"IFERROR(VLOOKUP(B10,'1_Původní'!A:P,16,FALSE),0)","v":499999.99999999994},{"$f":"IFERROR(VLOOKUP(B10,'2_Upravený'!A:P,16,FALSE),0)","v":499999.99999199988},{"$f":"ROUND(E10-D10,0)","v":0}]
[null,51874001,"Ostatní služby - provozní",{"$f":"IFERROR(VLOOKUP(B11,'1_Původní'!A:P,16,FALSE),0)","v":11051000.000299999},{"$f":"IFERROR(VLOOKUP(B11,'2_Upravený'!A:P,16,FALSE),0)","v":11050999.999995448},{"$f":"ROUND(E11-D11,0)","v":0}]
[]
[null,null,null,null,null,{"$f":"ROUND(SUM(F10:F11),0)","v":0}]
[]
[null,"Přehled plánovaných rezerv za garanta"]
[null,null,null,null,null,{"$f":"IF(COUNTIF('2_Upravený'!$Q:$Q,\"Obrat bez specifikace NS\")>0,COUNTIF('2_Upravený'!$Q:$Q,\"Obrat bez specifikace NS\"),\"\")","v":""}]
[null,"Bez rezerv",null,null,{"$f":"IF($F$16=\"\",\"\",\"Obrat\")","v":""},{"$f":"IF(COUNTIF('2_Upravený'!$Q:$Q,\"Obrat bez specifikace NS\")>0,SUMIF('2_Upravený'!$Q:$Q,\"Obrat bez specifikace NS\",'2_Upravený'!$P:$P),\"\")","v":""}]

{"sheet":"1_Původní","index":2,"n_rows":97,"n_cols":16,"rows_kept":97,"cut":false,"hidden":true,"merged":[]}
["Legenda",null,"Hodnoty v CZK"]
["Účet","Název účtu"]
[null,"NS","Název NS",202001,202002,202003,202004,202005,202006,202007,202008,202009,202010,202011,202012,"2020 celkem"]
[]
[51805001,"Průzkumné a projektové práce",null,{"$f":"SUM(D6:D32)","v":47133.259600000005},9722.7374,7750.4105999999992,30075.055400000001,34207.965000000004,71881.6783,34896.706600000005,76484.309599999993,13167.364300000001,47093.633800000003,68552.989399999991,59033.89,499999.99999999994]
[null,"0111","Lůžkové oddělení 1",6767.0252,0,0,0,0,0,0,0,0,0,0,0,{"$f":"SUM(D6:O6)","v":6767.0252}]
[null,"0301","Vedení klinického pracoviště",0,0,0,0,0,277.79250000000002,0,0,0,0,0,0,{"$f":"SUM(D7:O7)","v":277.79250000000002}]
[null,"0811","Lůžkové oddělení 19B (šestinedělí)",0,0,0,23417.218700000001,0,0,0,0,0,0,0,0,23417.218700000001]
[null,"0832","JIP 19 (porodní sál)",6250.3311999999996,0,0,0,0,0,0,0,0,0,0,0,6250.3311999999996]
[null,"0862","Porodní sál - lokální",0,0,0,0,0,0,0,0,0,0,0,11938.189899999999,11938.189899999999]
[null,"0863","Operační sál OP 17 (z 08 62)",2222.34,0,0,0,0,0,0,0,0,0,0,0,2222.34]
[null,"0931","JIP 16A +16D",0,0,0,0,10444.9979,0,0,0,0,0,0,0,10444.9979]
[null,"1001","Vedení klinického pracoviště",0,0,0,0,0,277.79250000000002,0,0,0,0,0,0,277.79250000000002]
[null,"1012","Lůžkové oddělení 28C vč.dospávací haly",0,0,0,0,7778.1899000000003,0,0,0,0,0,0,0,7778.1899000000003]
[null,"1121","Ambulance",0,0,0,0,0,0,0,10833.9074,0,0,0,0,10833.9074]
[null,"1162","Operační sál - lokální",0,0,0,0,0,0,0,10000.5299,0,0,0,0,10000.5299]
[null,"1211","Lůžkové oddělení",0,0,0,0,534.00440000000003,0,0,0,0,0,0,0,534.00440000000003]
[null,"1321","Ambulance",0,0,0,0,0,0,0,9028.2561000000005,0,0,0,0,9028.2561000000005]
[null,"1462","Operační sál - lokální",6944.8123999999998,0,0,0,0,0,0,0,0,0,0,0,6944.8123999999998]
[null,"1721","Ambulance",9056.0354000000007,0,0,0,0,0,0,0,0,0,0,0,9056.0354000000007]
[null,"1801","Vedení klinického pracoviště",0,0,0,0,0,0,0,0,0,6944.8123999999998,0,0,6944.8123999999998]
[null,"3341","Centrální laboratoř",0,0,0,0,0,0,0,0,4000.2118999999998,0,0,0,4000.2118999999998]
[null,"3342","Laboratoř DMP",0,0,0,0,2066.2251999999999,0,0,0,0,0,0,0,2066.2251999999999]
[null,"9001","Úsek ředitele",0,0,0,0,0,0,5055.8234000000002,0,0,0,0,0,5055.8234000000002]
[null,"9041","Útvar ekonomiky a zdravotních pojišťoven",0,0,0,0,0,0,5055.8234000000002,0,0,0,0,0,5055.8234000000002]
[null,"9051","Útvar hospodářsko technické správy",1611.1965,0,0,0,0,0,0,0,0,0,0,0,1611.1965]
[null,"9204","Areál FNOL",13170.348900000001,9722.7374,0,6657.8366999999998,11328.883099999999,60769.9784,21507.1083,46621.616199999997,9167.1524000000009,35315.232000000004,66802.896699999998,47095.700100000002,328159.4902]
[null,"9601","Ubytovny",0,0,0,0,2055.6644999999999,10556.1149,0,0,0,0,0,0,12611.779399999999]
[null,"9655","Byty",0,0,5833.6423999999997,0,0,0,0,0,0,4833.5893999999998,1750.0926999999999,0,12417.324499999999]
[null,"9901","Pronájmy Areál FNO",0,0,1916.7682,0,0,0,0,0,0,0,0,0,1916.7682]
[null,"9910","Pronájmy Areál Hněvotínská vč.kotelny",1111.17,0,0,0,0,0,3277.9515000000001,0,0,0,0,0,4389.1215000000002]
[]
[]
[51874001,"Ostatní služby - provozní",null,{"$f":"SUM(D35:D100)","v":69086.643200000006},1958673.7247000001,49691.940499999997,3121108.2130999998,1750326.5422,1841690.6300000001,1069627.7305999999,670585.3835,167931.33549999999,135284.4068,143628.3792,73365.070999999996,11051000.000299999]
[null,"0101","Vedení klinického pracoviště",0,0,0,0,0,0,0,0,743.65449999999998,0,0,0,{"$f":"SUM(D35:O35)","v":743.65449999999998}]
[null,"0231","JIP 30D",0,0,0,0,0,0,0,0,11877.6497,0,0,0,{"$f":"SUM(D36:O36)","v":11877.6497}]
[null,"0321","Ambulance",0,0,0,0,0,0,0,0,0,0,980.13660000000004,0,980.13660000000004]
[null,"0801","Vedení klinického pracoviště",4957.6967000000004,0,0,0,0,0,44.619300000000003,0,0,0,0,0,5002.3160000000007]
[null,"1112","Lůžkové oddělení 29B",0,0,0,0,0,74.365399999999994,0,0,0,0,0,0,74.365399999999994]
[null,"1704","OP VVV - Molekulární, buněčný a klinický přístup ke zdravému stárnutí",0,0,0,0,0,0,0,0,671.76790000000005,0,0,0,671.76790000000005]
[null,"2622","RHC ambulance + kineziologie,kinezioterapie",0,0,0,0,0,371.8272,0,0,0,0,0,0,371.8272]
[null,"3341","Centrální laboratoř",0,0,0,0,0,0,0,0,0,0,4109.4348,0,4109.4348]
[null,"3590","Výroba",0,0,0,0,0,0,0,0,0,0,849.25340000000006,0,849.25340000000006]
[null,"4141","Imunologie - laboratoř",24895.073799999998,0,0,0,0,0,0,0,0,0,0,0,24895.073799999998]
[null,"4764","Centrální operační sály",0,0,0,0,0,0,0,0,267.71559999999999,0,0,0,267.71559999999999]
[null,"5693","Oddělení centrální sterilizace",0,0,0,0,0,0,0,0,1133.3295000000001,0,0,0,1133.3295000000001]
[null,"8108","Klinická hodnocení - Porodnicko-gynekologická klinika",0,0,0,0,0,0,0,0,0,3217.5450999999998,0,0,3217.5450999999998]
[null,"8121","Klinická hodnocení - Onkologická klinika",0,0,0,0,0,0,0,0,0,0,1239.4241999999999,0,1239.4241999999999]
[null,"8507","Prof. MUDr. Vítězslav Kolek, DrSc. - PLIC",0,0,0,0,0,0,0,0,361.9119,0,0,0,361.9119]
[null,"8509","Doc. MUDr. Daniel Šaňák, PhD. - NEUROL",0,0,0,0,0,0,0,0,0,347.93119999999999,0,0,347.93119999999999]
[null,"8510","Doc. MUDr. Petr Hamal, PhD. - MIKRO",0,0,0,0,0,0,419.9169,6120.4996000000001,0,0,386.92340000000002,0,6927.3398999999999]
[null,"8533","MUDr. Milan Král, Ph.D. - UROL",0,0,0,0,0,0,0,0,0,0,644.50059999999996,0,644.50059999999996]
[null,"8541","MUDr. Richard Salzman, Ph.D. - ORL",0,0,0,0,0,0,0,0,14873.09,0,0,0,14873.09]
[null,"8555","Doc. RNDr. Radek Vrtěl, PhD. - GENETIKA",0,0,0,0,0,0,0,117.9932,0,84.280799999999999,4957.6967000000004,0,5159.9707000000008]
[null,"8556","MUDr. Tomáš Veverka, PhD. - NEUROL",0,0,0,40394.028400000003,0,0,2190.8062,0,0,206.959,0,0,42791.793600000005]
[null,"8558","MUDr. Filip Čtvrtlík, PhD. - RTG",0,0,0,0,0,3966.1572999999999,0,22148.0141,4957.6967000000004,0,3966.1572999999999,0,35038.025399999999]
[null,"8559","MUDr. JUDr. Dušan Klos, Ph.D. - I.CHIR",0,0,0,0,0,0,0,0,3420.3148999999999,0,0,0,3420.3148999999999]
[null,"8563","Doc. MUDr. Jan Minařík, Ph.D. - HOK",0,0,0,0,0,0,0,719.85760000000005,0,0,0,0,719.85760000000005]
[null,"8565","Prof. MUDr. Ing. Petr Hluštík, Ph.D. - NEUROL",0,0,0,0,0,0,0,0,0,1604.8063999999999,0,0,1604.8063999999999]
[null,"8709","RIV: MUDr. Aleš Grambal, PhD.",0,0,0,0,0,0,0,0,0,0,38957.887799999997,0,38957.887799999997]
[null,"8710","RIV: MUDr. Štefan Trnka",0,0,0,0,0,0,559.22820000000002,410.99310000000003,0,21212.9925,3390.0729999999999,0,25573.286800000002]
[null,"8712","RIV: prof. MUDr. Jiří Gallo, PhD.",0,0,0,0,0,0,0,0,31134.3351,0,0,0,31134.3351]
[null,"8715","RIV: MUDr. Karel Huml",0,0,0,0,0,0,0,0,0,0,46653.536899999999,0,46653.536899999999]
[null,"8716","RIV: MUDr. Beáta Hutyrová, PhD.",0,0,0,0,0,0,0,0,491.80349999999999,0,0,0,491.80349999999999]
[null,"8720","RIV: MUDr. Petr Kolář, PhD.",0,0,0,2943.3845000000001,0,0,0,0,760.64949999999999,0,0,0,3704.0340000000001]
[null,"8721","RIV: MUDr. Andrea Smržová",0,0,0,0,0,15362.96,0,0,991.04359999999997,0,0,0,16354.0036]
[null,"8725","RIV: MUDr. Helena Urbánková",0,0,0,0,233.2398,0,864.12649999999996,0,9714.8742999999995,432.31110000000001,0,2289.0279999999998,13533.5797]
[null,"8753","RIV: MUDr. Richard Salzmann, Ph.D.",0,0,0,4957.6967000000004,0,0,0,0,0,0,0,0,4957.6967000000004]
[null,"8755","RIV - MUDr. Roman Hájek, Ph. D.",0,0,0,0,14112.202499999999,0,551.79160000000002,0,0,0,0,0,14663.9941]
[null,"8760","RIV: RNDr. Martin Novák, Ph.D.",0,0,0,0,0,359.92880000000002,0,0,0,0,26994.658299999999,1689.8061,29044.393200000002]
[null,"8762","RIV - Doc. MUDr. David Karásek, Ph. D.",9915.3932999999997,0,4957.6967000000004,0,0,0,0,9518.7775999999994,0,3905.3512000000001,5475.9494999999997,0,33773.168299999998]
[null,"8767","RIV - Prof. MUDr. Jiří Gallo, Ph. D.",0,0,0,0,0,0,9756.7469999999994,21560.77,0,0,4799.0504000000001,0,36116.5674]
[null,"8768","RIV - Doc. MUDr. Karel Krejčí, Ph. D.",0,0,0,0,0,0,0,0,0,0,12070.5041,0,12070.5041]
[null,"8773","RIV - MUDr. Jan Hálek, Ph.D.",0,0,0,0,0,24788.4833,0,0,0,0,0,0,24788.4833]
[null,"8780","RIV - MUDr. Eva Karásková",0,3878.9018999999998,0,0,0,0,0,330.18259999999998,2160.5641999999998,0,1933.5017,0,8303.1504000000004]
[null,"8781","RIV - Doc. MUDr. Jiří Minařík, Ph. D.",0,0,24788.4833,378.27229999999997,0,0,0,719.85760000000005,1900.1660999999999,0,899.82190000000003,0,28686.601199999997]
[null,"8782","RIV - RNDr. Pavlína Čapková, Ph. D.",0,0,14037.222299999999,0,0,0,378.27229999999997,0,0,15479.798000000001,0,0,29895.292600000001]
[null,"8783","RIV - MUDr. Eva Klásková, Ph. D.",0,0,0,0,358.93720000000002,0,0,0,4957.6967000000004,4773.7660999999998,0,0,10090.400000000001]
[null,"8785","RIV - Doc. MUDr. Martin Hutyra, Ph. D.",0,0,0,0,0,0,0,0,7436.5450000000001,0,0,0,7436.5450000000001]
[null,"8786","RIV - MUDr. Pavel Hok",0,0,0,0,0,0,39700.322699999997,0,0,0,0,0,39700.322699999997]
[null,"8787","RIV - Dr. Gvansta Kharaishvili, Ph. D.",0,0,0,24788.4833,0,0,0,576.08439999999996,0,0,0,0,25364.5677]
[null,"8791","RIV - Doc. Mgr. Luděk Slavík, Ph. D. - MEX",0,0,1007.8997000000001,1580.5137,0,1320.7303999999999,838.84230000000002,16773.320599999999,245.90180000000001,4980.9978000000001,0,0,26748.206300000002]
[null,"8792","RIV - Prof. MUDr. Jiří Gallo, Ph. D. - MEX",4799.0504000000001,0,0,0,0,1421.2526,0,980.63239999999996,13508.8112,432.31110000000001,6009.8190999999997,0,27151.876799999998]
[null,"8794","RIV: MUDr. Martin Loveček, PhD. - MEX",0,0,0,0,0,0,731.26030000000003,0,0,4957.6967000000004,0,0,5688.9570000000003]
[null,"9001","Úsek ředitele",4409.3753999999999,899.82190000000003,0,0,0,5418.8517000000002,0,0,1367.7293999999999,0,19830.786700000001,19743.828699999998,51670.393799999998]
[null,"9010","Organizace plesu FN",0,0,338.95769999999999,0,0,0,0,0,0,0,0,0,338.95769999999999]
[null,"9028","Oddělení vědy a výzkumu",0,0,0,40542.68,0,0,4957.6967000000004,0,1153.1602,0,-46041.657899999998,0,611.87900000000081]
[null,"9041","Útvar ekonomiky a zdravotních pojišťoven",9798.0445999999993,0,127.4128,0,0,0,0,0,0,0,0,0,9925.4573999999993]
[null,"9051","Útvar hospodářsko technické správy",7436.5450000000001,0,0,1735.1938,0,0,0,44.619300000000003,1239.4241999999999,0,0,0,10455.782299999999]
[null,"9081","Úsek informačních technologií",0,0,0,0,0,1008.8913,0,0,0,0,0,0,1008.8913]
[null,"9084","Oddělení centrální spisovny",0,0,0,0,0,0,0,0,0,0,2099.5844999999999,0,2099.5844999999999]
[null,"9091","Obchodní úsek",0,0,0,0,0,0,0,0,0,0,3422.8928999999998,0,3422.8928999999998]
[null,"9096","Odbor marketingu",849.25340000000006,0,0,0,0,0,0,0,0,0,-1.5567,0,847.69670000000008]
[null,"9204","Areál FNOL",0,0,0,19796.0828,806224.28540000005,1787597.182,1021351.5841,590563.78139999998,52561.5,64991.521399999998,0,49642.408199999998,4392728.3453000002]
[null,"9209","Areál - ulice Profesora Fuky",0,1953895.0009000001,4434.268,2983991.8775999998,929397.87730000005,0,-12717.4835,0,0,0,0,0,5859001.5402999995]
[null,"9405","Provoz dopravy - sanitní - převoz zdrav. pojišťovny",2026.2106000000001,0,0,0,0,0,0,0,0,0,0,0,2026.2106000000001]
[null,"9819","TranMZČR: Bezpečnost a kvalita zdravotní péče",0,0,0,0,0,0,0,0,0,8656.1383999999998,0,0,8656.1383999999998]

{"sheet":"2_Upravený","index":3,"n_rows":100,"n_cols":21,"rows_kept":100,"cut":false,"hidden":true,"merged":[[0,16,1,16]]}
["Legenda",null,"Hodnoty v CZK",null,null,null,null,null,null,null,null,null,null,null,null,null,"Rozdíl"]
["Účet","Název účtu"]
[null,"NS","Název NS",202001,202002,202003,202004,202005,202006,202007,202008,202009,202010,202011,202012,"2020 celkem",{"$f":"SUM(Q4:Q33)","v":0}]
[]
[51805001,"Průzkumné a projektové práce",null,{"$f":"SUM(D6:D32)","v":41666.666665999997},41666.666665999997,41666.666665999997,41666.666665999997,41666.666665999997,41666.666665999997,41666.666665999997,41666.666665999997,41666.666665999997,41666.666665999997,41666.666665999997,41666.666665999997,499999.99999199988,{"$f":"ROUND(P5-SUMIF('1_Původní'!A:A,'2_Upravený'!A5,'1_Původní'!P:P),0)","v":0}]
[null,"0111","Lůžkové oddělení 1",0,0,0,0,0,0,0,0,0,0,0,0,{"$f":"SUM(D6:O6)","v":0},{"$f":"IF(AND(ROUND(P6,0)<>0,B6=\"\"),\"Obrat bez specifikace NS\",\"\")","v":""},null,"Orig",{"$f":"$A$5","v":51805001}]
[null,"0301","Vedení klinického pracoviště",0,0,0,0,0,0,0,0,0,0,0,0,{"$f":"SUM(D7:O7)","v":0},{"$f":"IF(AND(ROUND(P7,0)<>0,B7=\"\"),\"Obrat bez specifikace NS\",\"\")","v":""},null,"Orig",{"$f":"$A$5","v":51805001}]
[null,"0811","Lůžkové oddělení 19B (šestinedělí)",0,0,0,0,0,0,0,0,0,0,0,0,0,"",null,"Orig",51805001]
[null,"0832","JIP 19 (porodní sál)",0,0,0,0,0,0,0,0,0,0,0,0,0,"",null,"Orig",51805001]
[null,"0862","Porodní sál - lokální",0,0,0,0,0,0,0,0,0,0,0,0,0,"",null,"Orig",51805001]
[null,"0863","Operační sál OP 17 (z 08 62)",0,0,0,0,0,0,0,0,0,0,0,0,0,"",null,"Orig",51805001]
[null,"0931","JIP 16A +16D",0,0,0,0,0,0,0,0,0,0,0,0,0,"",null,"Orig",51805001]
[null,"1001","Vedení klinického pracoviště",0,0,0,0,0,0,0,0,0,0,0,0,0,"",null,"Orig",51805001]
[null,"1012","Lůžkové oddělení 28C vč.dospávací haly",0,0,0,0,0,0,0,0,0,0,0,0,0,"",null,"Orig",51805001]
[null,"1121","Ambulance",0,0,0,0,0,0,0,0,0,0,0,0,0,"",null,"Orig",51805001]
[null,"1162","Operační sál - lokální",0,0,0,0,0,0,0,0,0,0,0,0,0,"",null,"Orig",51805001]
[null,"1211","Lůžkové oddělení",0,0,0,0,0,0,0,0,0,0,0,0,0,"",null,"Orig",51805001]
[null,"1321","Ambulance",0,0,0,0,0,0,0,0,0,0,0,0,0,"",null,"Orig",51805001]
[null,"1462","Operační sál - lokální",0,0,0,0,0,0,0,0,0,0,0,0,0,"",null,"Orig",51805001]
[null,"1721","Ambulance",0,0,0,0,0,0,0,0,0,0,0,0,0,"",null,"Orig",51805001]
[null,"1801","Vedení klinického pracoviště",0,0,0,0,0,0,0,0,0,0,0,0,0,"",null,"Orig",51805001]
[null,"3341","Centrální laboratoř",0,0,0,0,0,0,0,0,0,0,0,0,0,"",null,"Orig",51805001]
[null,"3342","Laboratoř DMP",0,0,0,0,0,0,0,0,0,0,0,0,0,"",null,"Orig",51805001]
[null,"9001","Úsek ředitele",0,0,0,0,0,0,0,0,0,0,0,0,0,"",null,"Orig",51805001]
[null,"9041","Útvar ekonomiky a zdravotních pojišťoven",0,0,0,0,0,0,0,0,0,0,0,0,0,"",null,"Orig",51805001]
[null,"9051","Útvar hospodářsko technické správy",41666.666665999997,41666.666665999997,41666.666665999997,41666.666665999997,41666.666665999997,41666.666665999997,41666.666665999997,41666.666665999997,41666.666665999997,41666.666665999997,41666.666665999997,41666.666665999997,499999.99999199988,"",null,"Orig",51805001]
[null,"9204","Areál FNOL",0,0,0,0,0,0,0,0,0,0,0,0,0,"",null,"Orig",51805001]
[null,"9601","Ubytovny",0,0,0,0,0,0,0,0,0,0,0,0,0,"",null,"Orig",51805001]
[null,"9655","Byty",0,0,0,0,0,0,0,0,0,0,0,0,0,"",null,"Orig",51805001]
[null,"9901","Pronájmy Areál FNO",0,0,0,0,0,0,0,0,0,0,0,0,0,"",null,"Orig",51805001]
[null,"9910","Pronájmy Areál Hněvotínská vč.kotelny",0,0,0,0,0,0,0,0,0,0,0,0,0,"",null,"Orig",51805001]
[null,"",{"$f":"IFERROR(VLOOKUP(B32,CisNS!$A:$B,2,FALSE),\"\")","v":""},null,null,null,null,null,null,null,null,null,null,null,null,{"$f":"SUM(D32:O32)","v":0},{"$f":"IF(AND(ROUND(P32,0)<>0,B32=\"\"),\"Obrat bez specifikace NS\",\"\")","v":""},null,null,{"$f":"T6","v":51805001},"End"]
[]
[51874001,"Ostatní služby - provozní",null,{"$f":"SUM(D35:D100)","v":920916.66666628723},920916.66666628723,920916.66666628723,920916.66666628723,920916.66666628723,920916.66666628723,920916.66666628723,920916.66666628723,920916.66666628723,920916.66666628723,920916.66666628723,920916.66666628723,11050999.999995448,{"$f":"ROUND(P34-SUMIF('1_Původní'!A:A,'2_Upravený'!A34,'1_Původní'!P:P),0)","v":0}]
[null,"0101","Vedení klinického pracoviště",0,0,0,0,0,0,0,0,0,0,0,0,{"$f":"SUM(D35:O35)","v":0},{"$f":"IF(AND(ROUND(P35,0)<>0,B35=\"\"),\"Obrat bez specifikace NS\",\"\")","v":""},null,"Orig",{"$f":"$A$34","v":51874001}]
[null,"0231","JIP 30D",0,0,0,0,0,0,0,0,0,0,0,0,{"$f":"SUM(D36:O36)","v":0},{"$f":"IF(AND(ROUND(P36,0)<>0,B36=\"\"),\"Obrat bez specifikace NS\",\"\")","v":""},null,"Orig",{"$f":"$A$34","v":51874001}]
[null,"0321","Ambulance",0,0,0,0,0,0,0,0,0,0,0,0,0,"",null,"Orig",51874001]
[null,"0801","Vedení klinického pracoviště",0,0,0,0,0,0,0,0,0,0,0,0,0,"",null,"Orig",51874001]
[null,"1112","Lůžkové oddělení 29B",0,0,0,0,0,0,0,0,0,0,0,0,0,"",null,"Orig",51874001]
[null,"1704","OP VVV - Molekulární, buněčný a klinický přístup ke zdravému stárnutí",50000,50000,50000,50000,50000,50000,50000,50000,50000,50000,50000,50000,{"$f":"SUM(D40:O40)","v":600000},"",null,"Orig",51874001]
[null,"2622","RHC ambulance + kineziologie,kinezioterapie",0,0,0,0,0,0,0,0,0,0,0,0,0,"",null,"Orig",51874001]
[null,"3341","Centrální laboratoř",0,0,0,0,0,0,0,0,0,0,0,0,0,"",null,"Orig",51874001]
[null,"3590","Výroba",0,0,0,0,0,0,0,0,0,0,0,0,0,"",null,"Orig",51874001]
[null,"4141","Imunologie - laboratoř",0,0,0,0,0,0,0,0,0,0,0,0,0,"",null,"Orig",51874001]
[null,"4764","Centrální operační sály",0,0,0,0,0,0,0,0,0,0,0,0,0,"",null,"Orig",51874001]
[null,"5693","Oddělení centrální sterilizace",0,0,0,0,0,0,0,0,0,0,0,0,0,"",null,"Orig",51874001]
[null,"8108","Klinická hodnocení - Porodnicko-gynekologická klinika",0,0,0,0,0,0,0,0,0,0,0,0,0,"",null,"Orig",51874001]
[null,"8121","Klinická hodnocení - Onkologická klinika",0,0,0,0,0,0,0,0,0,0,0,0,0,"",null,"Orig",51874001]
[null,"8507","Prof. MUDr. Vítězslav Kolek, DrSc. - PLIC",0,0,0,0,0,0,0,0,0,0,0,0,0,"",null,"Orig",51874001]
[null,"8509","Doc. MUDr. Daniel Šaňák, PhD. - NEUROL",0,0,0,0,0,0,0,0,0,0,0,0,0,"",null,"Orig",51874001]
[null,"8510","Doc. MUDr. Petr Hamal, PhD. - MIKRO",0,0,0,0,0,0,0,0,0,0,0,0,0,"",null,"Orig",51874001]
[null,"8533","MUDr. Milan Král, Ph.D. - UROL",0,0,0,0,0,0,0,0,0,0,0,0,0,"",null,"Orig",51874001]
[null,"8541","MUDr. Richard Salzman, Ph.D. - ORL",0,0,0,0,0,0,0,0,0,0,0,0,0,"",null,"Orig",51874001]
[null,"8555","Doc. RNDr. Radek Vrtěl, PhD. - GENETIKA",0,0,0,0,0,0,0,0,0,0,0,0,0,"",null,"Orig",51874001]
[null,"8556","MUDr. Tomáš Veverka, PhD. - NEUROL",0,0,0,0,0,0,0,0,0,0,0,0,0,"",null,"Orig",51874001]
[null,"8558","MUDr. Filip Čtvrtlík, PhD. - RTG",0,0,0,0,0,0,0,0,0,0,0,0,0,"",null,"Orig",51874001]
[null,"8559","MUDr. JUDr. Dušan Klos, Ph.D. - I.CHIR",0,0,0,0,0,0,0,0,0,0,0,0,0,"",null,"Orig",51874001]
[null,"8563","Doc. MUDr. Jan Minařík, Ph.D. - HOK",0,0,0,0,0,0,0,0,0,0,0,0,0,"",null,"Orig",51874001]
[null,"8565","Prof. MUDr. Ing. Petr Hluštík, Ph.D. - NEUROL",0,0,0,0,0,0,0,0,0,0,0,0,0,"",null,"Orig",51874001]
[null,"8709","RIV: MUDr. Aleš Grambal, PhD.",0,0,0,0,0,0,0,0,0,0,0,0,0,"",null,"Orig",51874001]
[null,"8710","RIV: MUDr. Štefan Trnka",0,0,0,0,0,0,0,0,0,0,0,0,0,"",null,"Orig",51874001]
[null,"8712","RIV: prof. MUDr. Jiří Gallo, PhD.",0,0,0,0,0,0,0,0,0,0,0,0,0,"",null,"Orig",51874001]
[null,"8715","RIV: MUDr. Karel Huml",0,0,0,0,0,0,0,0,0,0,0,0,0,"",null,"Orig",51874001]
[null,"8716","RIV: MUDr. Beáta Hutyrová, PhD.",0,0,0,0,0,0,0,0,0,0,0,0,0,"",null,"Orig",51874001]
[null,"8720","RIV: MUDr. Petr Kolář, PhD.",0,0,0,0,0,0,0,0,0,0,0,0,0,"",null,"Orig",51874001]
[null,"8721","RIV: MUDr. Andrea Smržová",0,0,0,0,0,0,0,0,0,0,0,0,0,"",null,"Orig",51874001]
[null,"8725","RIV: MUDr. Helena Urbánková",0,0,0,0,0,0,0,0,0,0,0,0,0,"",null,"Orig",51874001]
[null,"8753","RIV: MUDr. Richard Salzmann, Ph.D.",0,0,0,0,0,0,0,0,0,0,0,0,0,"",null,"Orig",51874001]
[null,"8755","RIV - MUDr. Roman Hájek, Ph. D.",0,0,0,0,0,0,0,0,0,0,0,0,0,"",null,"Orig",51874001]
[null,"8760","RIV: RNDr. Martin Novák, Ph.D.",0,0,0,0,0,0,0,0,0,0,0,0,0,"",null,"Orig",51874001]
[null,"8762","RIV - Doc. MUDr. David Karásek, Ph. D.",0,0,0,0,0,0,0,0,0,0,0,0,0,"",null,"Orig",51874001]
[null,"8767","RIV - Prof. MUDr. Jiří Gallo, Ph. D.",0,0,0,0,0,0,0,0,0,0,0,0,0,"",null,"Orig",51874001]
[null,"8768","RIV - Doc. MUDr. Karel Krejčí, Ph. D.",0,0,0,0,0,0,0,0,0,0,0,0,0,"",null,"Orig",51874001]
[null,"8773","RIV - MUDr. Jan Hálek, Ph.D.",0,0,0,0,0,0,0,0,0,0,0,0,0,"",null,"Orig",51874001]
[null,"8780","RIV - MUDr. Eva Karásková",0,0,0,0,0,0,0,0,0,0,0,0,0,"",null,"Orig",51874001]
[null,"8781","RIV - Doc. MUDr. Jiří Minařík, Ph. D.",0,0,0,0,0,0,0,0,0,0,0,0,0,"",null,"Orig",51874001]
[null,"8782","RIV - RNDr. Pavlína Čapková, Ph. D.",0,0,0,0,0,0,0,0,0,0,0,0,0,"",null,"Orig",51874001]
[null,"8783","RIV - MUDr. Eva Klásková, Ph. D.",0,0,0,0,0,0,0,0,0,0,0,0,0,"",null,"Orig",51874001]
[null,"8785","RIV - Doc. MUDr. Martin Hutyra, Ph. D.",0,0,0,0,0,0,0,0,0,0,0,0,0,"",null,"Orig",51874001]
[null,"8786","RIV - MUDr. Pavel Hok",0,0,0,0,0,0,0,0,0,0,0,0,0,"",null,"Orig",51874001]
[null,"8787","RIV - Dr. Gvansta Kharaishvili, Ph. D.",0,0,0,0,0,0,0,0,0,0,0,0,0,"",null,"Orig",51874001]
[null,"8791","RIV - Doc. Mgr. Luděk Slavík, Ph. D. - MEX",0,0,0,0,0,0,0,0,0,0,0,0,0,"",null,"Orig",51874001]
[null,"8792","RIV - Prof. MUDr. Jiří Gallo, Ph. D. - MEX",0,0,0,0,0,0,0,0,0,0,0,0,0,"",null,"Orig",51874001]
[null,"8794","RIV: MUDr. Martin Loveček, PhD. - MEX",146750,146750,146750,146750,146750,146750,146750,146750,146750,146750,146750,146750,{"$f":"SUM(D84:O84)","v":1761000},"",null,"Orig",51874001]
[null,"9001","Úsek ředitele",0,0,0,0,0,0,0,0,0,0,0,0,{"$f":"SUM(D85:O85)","v":0},"",null,"Orig",51874001]
[null,"9010","Organizace plesu FN",0,0,0,0,0,0,0,0,0,0,0,0,0,"",null,"Orig",51874001]
[null,"9028","Oddělení vědy a výzkumu",0,0,0,0,0,0,0,0,0,0,0,0,0,"",null,"Orig",51874001]
[null,"9041","Útvar ekonomiky a zdravotních pojišťoven",0,0,0,0,0,0,0,0,0,0,0,0,0,"",null,"Orig",51874001]
[null,"9051","Útvar hospodářsko technické správy",524166.66666628729,524166.66666628729,524166.66666628729,524166.66666628729,524166.66666628729,524166.66666628729,524166.66666628729,524166.66666628729,524166.66666628729,524166.66666628729,524166.66666628729,524166.66666628729,{"$f":"SUM(D89:O89)","v":6289999.9999954468},"",null,"Orig",51874001]
[null,"9081","Úsek informačních technologií",0,0,0,0,0,0,0,0,0,0,0,0,0,"",null,"Orig",51874001]
[null,"9084","Oddělení centrální spisovny",0,0,0,0,0,0,0,0,0,0,0,0,0,"",null,"Orig",51874001]
[null,"9091","Obchodní úsek",0,0,0,0,0,0,0,0,0,0,0,0,0,"",null,"Orig",51874001]
[null,"9096","Odbor marketingu",0,0,0,0,0,0,0,0,0,0,0,0,0,"",null,"Orig",51874001]
[null,"9204","Areál FNOL",0,0,0,0,0,0,0,0,0,0,0,0,0,"",null,"Orig",51874001]
[null,"9209","Areál - ulice Profesora Fuky",0,0,0,0,0,0,0,0,0,0,0,0,0,"",null,"Orig",51874001]
[null,"9405","Provoz dopravy - sanitní - převoz zdrav. pojišťovny",0,0,0,0,0,0,0,0,0,0,0,0,0,"",null,"Orig",51874001]
[null,"9819","TranMZČR: Bezpečnost a kvalita zdravotní péče",0,0,0,0,0,0,0,0,0,0,0,0,0,"",null,"Orig",51874001]
[null,"8599",{"$f":"IFERROR(VLOOKUP(B98,CisNS!$A:$B,2,FALSE),\"\")","v":"Granty - pomocné středisko"},50000,50000,50000,50000,50000,50000,50000,50000,50000,50000,50000,50000,{"$f":"SUM(D98:O98)","v":600000},{"$f":"IF(AND(ROUND(P98,0)<>0,B98=\"\"),\"Obrat bez specifikace NS\",\"\")","v":""},null,null,51874001]
[null,"8988",{"$f":"IFERROR(VLOOKUP(B99,CisNS!$A:$B,2,FALSE),\"\")","v":"Pomocné středisko"},150000,150000,150000,150000,150000,150000,150000,150000,150000,150000,150000,150000,{"$f":"SUM(D99:O99)","v":1800000},{"$f":"IF(AND(ROUND(P99,0)<>0,B99=\"\"),\"Obrat bez specifikace NS\",\"\")","v":""},null,null,51874001]
[null,"",{"$f":"IFERROR(VLOOKUP(B100,CisNS!$A:$B,2,FALSE),\"\")","v":""},null,null,null,null,null,null,null,null,null,null,null,null,0,"",null,null,{"$f":"T35","v":51874001},"End"]

{"sheet":"3_Rozdíly","index":4,"n_rows":100,"n_cols":16,"rows_kept":100,"cut":false,"hidden":true,"merged":[]}
["Legenda",null,"Hodnoty v CZK"]
["Účet","Název účtu"]
[null,"NS","Název NS",202001,202002,202003,202004,202005,202006,202007,202008,202009,202010,202011,202012,"2020 celkem"]
[]
[51805001,"Průzkumné a projektové práce",null,{"$f":"SUM(D32:D32)","v":0},0,0,0,0,0,0,0,0,0,0,0,0]
[null,{"$f":"IF('2_Upravený'!B6=\"\",\"\",'2_Upravený'!B6)","v":"0111"},{"$f":"IF('2_Upravený'!C6=\"\",\"\",'2_Upravený'!C6)","v":"Lůžkové oddělení 1"},{"$f":"'2_Upravený'!D6-'1_Původní'!D6","v":-6767.0252},{"$f":"'2_Upravený'!E6-'1_Původní'!E6","v":0},{"$f":"'2_Upravený'!F6-'1_Původní'!F6","v":0},{"$f":"'2_Upravený'!G6-'1_Původní'!G6","v":0},{"$f":"'2_Upravený'!H6-'1_Původní'!H6","v":0},{"$f":"'2_Upravený'!I6-'1_Původní'!I6","v":0},{"$f":"'2_Upravený'!J6-'1_Původní'!J6","v":0},{"$f":"'2_Upravený'!K6-'1_Původní'!K6","v":0},{"$f":"'2_Upravený'!L6-'1_Původní'!L6","v":0},{"$f":"'2_Upravený'!M6-'1_Původní'!M6","v":0},{"$f":"'2_Upravený'!N6-'1_Původní'!N6","v":0},{"$f":"'2_Upravený'!O6-'1_Původní'!O6","v":0},{"$f":"SUM(D6:O6)","v":-6767.0252}]
[null,{"$f":"IF('2_Upravený'!B7=\"\",\"\",'2_Upravený'!B7)","v":"0301"},{"$f":"IF('2_Upravený'!C7=\"\",\"\",'2_Upravený'!C7)","v":"Vedení klinického pracoviště"},{"$f":"'2_Upravený'!D7-'1_Původní'!D7","v":0},{"$f":"'2_Upravený'!E7-'1_Původní'!E7","v":0},{"$f":"'2_Upravený'!F7-'1_Původní'!F7","v":0},{"$f":"'2_Upravený'!G7-'1_Původní'!G7","v":0},{"$f":"'2_Upravený'!H7-'1_Původní'!H7","v":0},{"$f":"'2_Upravený'!I7-'1_Původní'!I7","v":-277.79250000000002},{"$f":"'2_Upravený'!J7-'1_Původní'!J7","v":0},{"$f":"'2_Upravený'!K7-'1_Původní'!K7","v":0},{"$f":"'2_Upravený'!L7-'1_Původní'!L7","v":0},{"$f":"'2_Upravený'!M7-'1_Původní'!M7","v":0},{"$f":"'2_Upravený'!N7-'1_Původní'!N7","v":0},{"$f":"'2_Upravený'!O7-'1_Původní'!O7","v":0},{"$f":"SUM(D7:O7)","v":-277.79250000000002}]
[null,{"$f":"IF('2_Upravený'!B8=\"\",\"\",'2_Upravený'!B8)","v":"0811"},{"$f":"IF('2_Upravený'!C8=\"\",\"\",'2_Upravený'!C8)","v":"Lůžkové oddělení 19B (šestinedělí)"},{"$f":"'2_Upravený'!D8-'1_Původní'!D8","v":0},{"$f":"'2_Upravený'!E8-'1_Původní'!E8","v":0},{"$f":"'2_Upravený'!F8-'1_Původní'!F8","v":0},{"$f":"'2_Upravený'!G8-'1_Původní'!G8","v":-23417.218700000001},{"$f":"'2_Upravený'!H8-'1_Původní'!H8","v":0},{"$f":"'2_Upravený'!I8-'1_Původní'!I8","v":0},{"$f":"'2_Upravený'!J8-'1_Původní'!J8","v":0},{"$f":"'2_Upravený'!K8-'1_Původní'!K8","v":0},{"$f":"'2_Upravený'!L8-'1_Původní'!L8","v":0},{"$f":"'2_Upravený'!M8-'1_Původní'!M8","v":0},{"$f":"'2_Upravený'!N8-'1_Původní'!N8","v":0},{"$f":"'2_Upravený'!O8-'1_Původní'!O8","v":0},-23417.218700000001]
[null,{"$f":"IF('2_Upravený'!B9=\"\",\"\",'2_Upravený'!B9)","v":"0832"},{"$f":"IF('2_Upravený'!C9=\"\",\"\",'2_Upravený'!C9)","v":"JIP 19 (porodní sál)"},{"$f":"'2_Upravený'!D9-'1_Původní'!D9","v":-6250.3311999999996},{"$f":"'2_Upravený'!E9-'1_Původní'!E9","v":0},{"$f":"'2_Upravený'!F9-'1_Původní'!F9","v":0},{"$f":"'2_Upravený'!G9-'1_Původní'!G9","v":0},{"$f":"'2_Upravený'!H9-'1_Původní'!H9","v":0},{"$f":"'2_Upravený'!I9-'1_Původní'!I9","v":0},{"$f":"'2_Upravený'!J9-'1_Původní'!J9","v":0},{"$f":"'2_Upravený'!K9-'1_Původní'!K9","v":0},{"$f":"'2_Upravený'!L9-'1_Původní'!L9","v":0},{"$f":"'2_Upravený'!M9-'1_Původní'!M9","v":0},{"$f":"'2_Upravený'!N9-'1_Původní'!N9","v":0},{"$f":"'2_Upravený'!O9-'1_Původní'!O9","v":0},-6250.3311999999996]
[null,{"$f":"IF('2_Upravený'!B10=\"\",\"\",'2_Upravený'!B10)","v":"0862"},{"$f":"IF('2_Upravený'!C10=\"\",\"\",'2_Upravený'!C10)","v":"Porodní sál - lokální"},{"$f":"'2_Upravený'!D10-'1_Původní'!D10","v":0},{"$f":"'2_Upravený'!E10-'1_Původní'!E10","v":0},{"$f":"'2_Upravený'!F10-'1_Původní'!F10","v":0},{"$f":"'2_Upravený'!G10-'1_Původní'!G10","v":0},{"$f":"'2_Upravený'!H10-'1_Původní'!H10","v":0},{"$f":"'2_Upravený'!I10-'1_Původní'!I10","v":0},{"$f":"'2_Upravený'!J10-'1_Původní'!J10","v":0},{"$f":"'2_Upravený'!K10-'1_Původní'!K10","v":0},{"$f":"'2_Upravený'!L10-'1_Původní'!L10","v":0},{"$f":"'2_Upravený'!M10-'1_Původní'!M10","v":0},{"$f":"'2_Upravený'!N10-'1_Původní'!N10","v":0},{"$f":"'2_Upravený'!O10-'1_Původní'!O10","v":-11938.189899999999},-11938.189899999999]
[null,{"$f":"IF('2_Upravený'!B11=\"\",\"\",'2_Upravený'!B11)","v":"0863"},{"$f":"IF('2_Upravený'!C11=\"\",\"\",'2_Upravený'!C11)","v":"Operační sál OP 17 (z 08 62)"},{"$f":"'2_Upravený'!D11-'1_Původní'!D11","v":-2222.34},{"$f":"'2_Upravený'!E11-'1_Původní'!E11","v":0},{"$f":"'2_Upravený'!F11-'1_Původní'!F11","v":0},{"$f":"'2_Upravený'!G11-'1_Původní'!G11","v":0},{"$f":"'2_Upravený'!H11-'1_Původní'!H11","v":0},{"$f":"'2_Upravený'!I11-'1_Původní'!I11","v":0},{"$f":"'2_Upravený'!J11-'1_Původní'!J11","v":0},{"$f":"'2_Upravený'!K11-'1_Původní'!K11","v":0},{"$f":"'2_Upravený'!L11-'1_Původní'!L11","v":0},{"$f":"'2_Upravený'!M11-'1_Původní'!M11","v":0},{"$f":"'2_Upravený'!N11-'1_Původní'!N11","v":0},{"$f":"'2_Upravený'!O11-'1_Původní'!O11","v":0},-2222.34]
[null,{"$f":"IF('2_Upravený'!B12=\"\",\"\",'2_Upravený'!B12)","v":"0931"},{"$f":"IF('2_Upravený'!C12=\"\",\"\",'2_Upravený'!C12)","v":"JIP 16A +16D"},{"$f":"'2_Upravený'!D12-'1_Původní'!D12","v":0},{"$f":"'2_Upravený'!E12-'1_Původní'!E12","v":0},{"$f":"'2_Upravený'!F12-'1_Původní'!F12","v":0},{"$f":"'2_Upravený'!G12-'1_Původní'!G12","v":0},{"$f":"'2_Upravený'!H12-'1_Původní'!H12","v":-10444.9979},{"$f":"'2_Upravený'!I12-'1_Původní'!I12","v":0},{"$f":"'2_Upravený'!J12-'1_Původní'!J12","v":0},{"$f":"'2_Upravený'!K12-'1_Původní'!K12","v":0},{"$f":"'2_Upravený'!L12-'1_Původní'!L12","v":0},{"$f":"'2_Upravený'!M12-'1_Původní'!M12","v":0},{"$f":"'2_Upravený'!N12-'1_Původní'!N12","v":0},{"$f":"'2_Upravený'!O12-'1_Původní'!O12","v":0},-10444.9979]
[null,{"$f":"IF('2_Upravený'!B13=\"\",\"\",'2_Upravený'!B13)","v":"1001"},{"$f":"IF('2_Upravený'!C13=\"\",\"\",'2_Upravený'!C13)","v":"Vedení klinického pracoviště"},{"$f":"'2_Upravený'!D13-'1_Původní'!D13","v":0},{"$f":"'2_Upravený'!E13-'1_Původní'!E13","v":0},{"$f":"'2_Upravený'!F13-'1_Původní'!F13","v":0},{"$f":"'2_Upravený'!G13-'1_Původní'!G13","v":0},{"$f":"'2_Upravený'!H13-'1_Původní'!H13","v":0},{"$f":"'2_Upravený'!I13-'1_Původní'!I13","v":-277.79250000000002},{"$f":"'2_Upravený'!J13-'1_Původní'!J13","v":0},{"$f":"'2_Upravený'!K13-'1_Původní'!K13","v":0},{"$f":"'2_Upravený'!L13-'1_Původní'!L13","v":0},{"$f":"'2_Upravený'!M13-'1_Původní'!M13","v":0},{"$f":"'2_Upravený'!N13-'1_Původní'!N13","v":0},{"$f":"'2_Upravený'!O13-'1_Původní'!O13","v":0},-277.79250000000002]
[null,{"$f":"IF('2_Upravený'!B14=\"\",\"\",'2_Upravený'!B14)","v":"1012"},{"$f":"IF('2_Upravený'!C14=\"\",\"\",'2_Upravený'!C14)","v":"Lůžkové oddělení 28C vč.dospávací haly"},{"$f":"'2_Upravený'!D14-'1_Původní'!D14","v":0},{"$f":"'2_Upravený'!E14-'1_Původní'!E14","v":0},{"$f":"'2_Upravený'!F14-'1_Původní'!F14","v":0},{"$f":"'2_Upravený'!G14-'1_Původní'!G14","v":0},{"$f":"'2_Upravený'!H14-'1_Původní'!H14","v":-7778.1899000000003},{"$f":"'2_Upravený'!I14-'1_Původní'!I14","v":0},{"$f":"'2_Upravený'!J14-'1_Původní'!J14","v":0},{"$f":"'2_Upravený'!K14-'1_Původní'!K14","v":0},{"$f":"'2_Upravený'!L14-'1_Původní'!L14","v":0},{"$f":"'2_Upravený'!M14-'1_Původní'!M14","v":0},{"$f":"'2_Upravený'!N14-'1_Původní'!N14","v":0},{"$f":"'2_Upravený'!O14-'1_Původní'!O14","v":0},-7778.1899000000003]
[null,{"$f":"IF('2_Upravený'!B15=\"\",\"\",'2_Upravený'!B15)","v":"1121"},{"$f":"IF('2_Upravený'!C15=\"\",\"\",'2_Upravený'!C15)","v":"Ambulance"},{"$f":"'2_Upravený'!D15-'1_Původní'!D15","v":0},{"$f":"'2_Upravený'!E15-'1_Původní'!E15","v":0},{"$f":"'2_Upravený'!F15-'1_Původní'!F15","v":0},{"$f":"'2_Upravený'!G15-'1_Původní'!G15","v":0},{"$f":"'2_Upravený'!H15-'1_Původní'!H15","v":0},{"$f":"'2_Upravený'!I15-'1_Původní'!I15","v":0},{"$f":"'2_Upravený'!J15-'1_Původní'!J15","v":0},{"$f":"'2_Upravený'!K15-'1_Původní'!K15","v":-10833.9074},{"$f":"'2_Upravený'!L15-'1_Původní'!L15","v":0},{"$f":"'2_Upravený'!M15-'1_Původní'!M15","v":0},{"$f":"'2_Upravený'!N15-'1_Původní'!N15","v":0},{"$f":"'2_Upravený'!O15-'1_Původní'!O15","v":0},-10833.9074]
[null,{"$f":"IF('2_Upravený'!B16=\"\",\"\",'2_Upravený'!B16)","v":"1162"},{"$f":"IF('2_Upravený'!C16=\"\",\"\",'2_Upravený'!C16)","v":"Operační sál - lokální"},{"$f":"'2_Upravený'!D16-'1_Původní'!D16","v":0},{"$f":"'2_Upravený'!E16-'1_Původní'!E16","v":0},{"$f":"'2_Upravený'!F16-'1_Původní'!F16","v":0},{"$f":"'2_Upravený'!G16-'1_Původní'!G16","v":0},{"$f":"'2_Upravený'!H16-'1_Původní'!H16","v":0},{"$f":"'2_Upravený'!I16-'1_Původní'!I16","v":0},{"$f":"'2_Upravený'!J16-'1_Původní'!J16","v":0},{"$f":"'2_Upravený'!K16-'1_Původní'!K16","v":-10000.5299},{"$f":"'2_Upravený'!L16-'1_Původní'!L16","v":0},{"$f":"'2_Upravený'!M16-'1_Původní'!M16","v":0},{"$f":"'2_Upravený'!N16-'1_Původní'!N16","v":0},{"$f":"'2_Upravený'!O16-'1_Původní'!O16","v":0},-10000.5299]
[null,{"$f":"IF('2_Upravený'!B17=\"\",\"\",'2_Upravený'!B17)","v":"1211"},{"$f":"IF('2_Upravený'!C17=\"\",\"\",'2_Upravený'!C17)","v":"Lůžkové oddělení"},{"$f":"'2_Upravený'!D17-'1_Původní'!D17","v":0},{"$f":"'2_Upravený'!E17-'1_Původní'!E17","v":0},{"$f":"'2_Upravený'!F17-'1_Původní'!F17","v":0},{"$f":"'2_Upravený'!G17-'1_Původní'!G17","v":0},{"$f":"'2_Upravený'!H17-'1_Původní'!H17","v":-534.00440000000003},{"$f":"'2_Upravený'!I17-'1_Původní'!I17","v":0},{"$f":"'2_Upravený'!J17-'1_Původní'!J17","v":0},{"$f":"'2_Upravený'!K17-'1_Původní'!K17","v":0},{"$f":"'2_Upravený'!L17-'1_Původní'!L17","v":0},{"$f":"'2_Upravený'!M17-'1_Původní'!M17","v":0},{"$f":"'2_Upravený'!N17-'1_Původní'!N17","v":0},{"$f":"'2_Upravený'!O17-'1_Původní'!O17","v":0},-534.00440000000003]
[null,{"$f":"IF('2_Upravený'!B18=\"\",\"\",'2_Upravený'!B18)","v":"1321"},{"$f":"IF('2_Upravený'!C18=\"\",\"\",'2_Upravený'!C18)","v":"Ambulance"},{"$f":"'2_Upravený'!D18-'1_Původní'!D18","v":0},{"$f":"'2_Upravený'!E18-'1_Původní'!E18","v":0},{"$f":"'2_Upravený'!F18-'1_Původní'!F18","v":0},{"$f":"'2_Upravený'!G18-'1_Původní'!G18","v":0},{"$f":"'2_Upravený'!H18-'1_Původní'!H18","v":0},{"$f":"'2_Upravený'!I18-'1_Původní'!I18","v":0},{"$f":"'2_Upravený'!J18-'1_Původní'!J18","v":0},{"$f":"'2_Upravený'!K18-'1_Původní'!K18","v":-9028.2561000000005},{"$f":"'2_Upravený'!L18-'1_Původní'!L18","v":0},{"$f":"'2_Upravený'!M18-'1_Původní'!M18","v":0},{"$f":"'2_Upravený'!N18-'1_Původní'!N18","v":0},{"$f":"'2_Upravený'!O18-'1_Původní'!O18","v":0},-9028.2561000000005]
[null,{"$f":"IF('2_Upravený'!B19=\"\",\"\",'2_Upravený'!B19)","v":"1462"},{"$f":"IF('2_Upravený'!C19=\"\",\"\",'2_Upravený'!C19)","v":"Operační sál - lokální"},{"$f":"'2_Upravený'!D19-'1_Původní'!D19","v":-6944.8123999999998},{"$f":"'2_Upravený'!E19-'1_Původní'!E19","v":0},{"$f":"'2_Upravený'!F19-'1_Původní'!F19","v":0},{"$f":"'2_Upravený'!G19-'1_Původní'!G19","v":0},{"$f":"'2_Upravený'!H19-'1_Původní'!H19","v":0},{"$f":"'2_Upravený'!I19-'1_Původní'!I19","v":0},{"$f":"'2_Upravený'!J19-'1_Původní'!J19","v":0},{"$f":"'2_Upravený'!K19-'1_Původní'!K19","v":0},{"$f":"'2_Upravený'!L19-'1_Původní'!L19","v":0},{"$f":"'2_Upravený'!M19-'1_Původní'!M19","v":0},{"$f":"'2_Upravený'!N19-'1_Původní'!N19","v":0},{"$f":"'2_Upravený'!O19-'1_Původní'!O19","v":0},-6944.8123999999998]
[null,{"$f":"IF('2_Upravený'!B20=\"\",\"\",'2_Upravený'!B20)","v":"1721"},{"$f":"IF('2_Upravený'!C20=\"\",\"\",'2_Upravený'!C20)","v":"Ambulance"},{"$f":"'2_Upravený'!D20-'1_Původní'!D20","v":-9056.0354000000007},{"$f":"'2_Upravený'!E20-'1_Původní'!E20","v":0},{"$f":"'2_Upravený'!F20-'1_Původní'!F20","v":0},{"$f":"'2_Upravený'!G20-'1_Původní'!G20","v":0},{"$f":"'2_Upravený'!H20-'1_Původní'!H20","v":0},{"$f":"'2_Upravený'!I20-'1_Původní'!I20","v":0},{"$f":"'2_Upravený'!J20-'1_Původní'!J20","v":0},{"$f":"'2_Upravený'!K20-'1_Původní'!K20","v":0},{"$f":"'2_Upravený'!L20-'1_Původní'!L20","v":0},{"$f":"'2_Upravený'!M20-'1_Původní'!M20","v":0},{"$f":"'2_Upravený'!N20-'1_Původní'!N20","v":0},{"$f":"'2_Upravený'!O20-'1_Původní'!O20","v":0},-9056.0354000000007]
[null,{"$f":"IF('2_Upravený'!B21=\"\",\"\",'2_Upravený'!B21)","v":"1801"},{"$f":"IF('2_Upravený'!C21=\"\",\"\",'2_Upravený'!C21)","v":"Vedení klinického pracoviště"},{"$f":"'2_Upravený'!D21-'1_Původní'!D21","v":0},{"$f":"'2_Upravený'!E21-'1_Původní'!E21","v":0},{"$f":"'2_Upravený'!F21-'1_Původní'!F21","v":0},{"$f":"'2_Upravený'!G21-'1_Původní'!G21","v":0},{"$f":"'2_Upravený'!H21-'1_Původní'!H21","v":0},{"$f":"'2_Upravený'!I21-'1_Původní'!I21","v":0},{"$f":"'2_Upravený'!J21-'1_Původní'!J21","v":0},{"$f":"'2_Upravený'!K21-'1_Původní'!K21","v":0},{"$f":"'2_Upravený'!L21-'1_Původní'!L21","v":0},{"$f":"'2_Upravený'!M21-'1_Původní'!M21","v":-6944.8123999999998},{"$f":"'2_Upravený'!N21-'1_Původní'!N21","v":0},{"$f":"'2_Upravený'!O21-'1_Původní'!O21","v":0},-6944.8123999999998]
[null,{"$f":"IF('2_Upravený'!B22=\"\",\"\",'2_Upravený'!B22)","v":"3341"},{"$f":"IF('2_Upravený'!C22=\"\",\"\",'2_Upravený'!C22)","v":"Centrální laboratoř"},{"$f":"'2_Upravený'!D22-'1_Původní'!D22","v":0},{"$f":"'2_Upravený'!E22-'1_Původní'!E22","v":0},{"$f":"'2_Upravený'!F22-'1_Původní'!F22","v":0},{"$f":"'2_Upravený'!G22-'1_Původní'!G22","v":0},{"$f":"'2_Upravený'!H22-'1_Původní'!H22","v":0},{"$f":"'2_Upravený'!I22-'1_Původní'!I22","v":0},{"$f":"'2_Upravený'!J22-'1_Původní'!J22","v":0},{"$f":"'2_Upravený'!K22-'1_Původní'!K22","v":0},{"$f":"'2_Upravený'!L22-'1_Původní'!L22","v":-4000.2118999999998},{"$f":"'2_Upravený'!M22-'1_Původní'!M22","v":0},{"$f":"'2_Upravený'!N22-'1_Původní'!N22","v":0},{"$f":"'2_Upravený'!O22-'1_Původní'!O22","v":0},-4000.2118999999998]
[null,{"$f":"IF('2_Upravený'!B23=\"\",\"\",'2_Upravený'!B23)","v":"3342"},{"$f":"IF('2_Upravený'!C23=\"\",\"\",'2_Upravený'!C23)","v":"Laboratoř DMP"},{"$f":"'2_Upravený'!D23-'1_Původní'!D23","v":0},{"$f":"'2_Upravený'!E23-'1_Původní'!E23","v":0},{"$f":"'2_Upravený'!F23-'1_Původní'!F23","v":0},{"$f":"'2_Upravený'!G23-'1_Původní'!G23","v":0},{"$f":"'2_Upravený'!H23-'1_Původní'!H23","v":-2066.2251999999999},{"$f":"'2_Upravený'!I23-'1_Původní'!I23","v":0},{"$f":"'2_Upravený'!J23-'1_Původní'!J23","v":0},{"$f":"'2_Upravený'!K23-'1_Původní'!K23","v":0},{"$f":"'2_Upravený'!L23-'1_Původní'!L23","v":0},{"$f":"'2_Upravený'!M23-'1_Původní'!M23","v":0},{"$f":"'2_Upravený'!N23-'1_Původní'!N23","v":0},{"$f":"'2_Upravený'!O23-'1_Původní'!O23","v":0},-2066.2251999999999]
[null,{"$f":"IF('2_Upravený'!B24=\"\",\"\",'2_Upravený'!B24)","v":"9001"},{"$f":"IF('2_Upravený'!C24=\"\",\"\",'2_Upravený'!C24)","v":"Úsek ředitele"},{"$f":"'2_Upravený'!D24-'1_Původní'!D24","v":0},{"$f":"'2_Upravený'!E24-'1_Původní'!E24","v":0},{"$f":"'2_Upravený'!F24-'1_Původní'!F24","v":0},{"$f":"'2_Upravený'!G24-'1_Původní'!G24","v":0},{"$f":"'2_Upravený'!H24-'1_Původní'!H24","v":0},{"$f":"'2_Upravený'!I24-'1_Původní'!I24","v":0},{"$f":"'2_Upravený'!J24-'1_Původní'!J24","v":-5055.8234000000002},{"$f":"'2_Upravený'!K24-'1_Původní'!K24","v":0},{"$f":"'2_Upravený'!L24-'1_Původní'!L24","v":0},{"$f":"'2_Upravený'!M24-'1_Původní'!M24","v":0},{"$f":"'2_Upravený'!N24-'1_Původní'!N24","v":0},{"$f":"'2_Upravený'!O24-'1_Původní'!O24","v":0},-5055.8234000000002]
[null,{"$f":"IF('2_Upravený'!B25=\"\",\"\",'2_Upravený'!B25)","v":"9041"},{"$f":"IF('2_Upravený'!C25=\"\",\"\",'2_Upravený'!C25)","v":"Útvar ekonomiky a zdravotních pojišťoven"},{"$f":"'2_Upravený'!D25-'1_Původní'!D25","v":0},{"$f":"'2_Upravený'!E25-'1_Původní'!E25","v":0},{"$f":"'2_Upravený'!F25-'1_Původní'!F25","v":0},{"$f":"'2_Upravený'!G25-'1_Původní'!G25","v":0},{"$f":"'2_Upravený'!H25-'1_Původní'!H25","v":0},{"$f":"'2_Upravený'!I25-'1_Původní'!I25","v":0},{"$f":"'2_Upravený'!J25-'1_Původní'!J25","v":-5055.8234000000002},{"$f":"'2_Upravený'!K25-'1_Původní'!K25","v":0},{"$f":"'2_Upravený'!L25-'1_Původní'!L25","v":0},{"$f":"'2_Upravený'!M25-'1_Původní'!M25","v":0},{"$f":"'2_Upravený'!N25-'1_Původní'!N25","v":0},{"$f":"'2_Upravený'!O25-'1_Původní'!O25","v":0},-5055.8234000000002]
[null,{"$f":"IF('2_Upravený'!B26=\"\",\"\",'2_Upravený'!B26)","v":"9051"},{"$f":"IF('2_Upravený'!C26=\"\",\"\",'2_Upravený'!C26)","v":"Útvar hospodářsko technické správy"},{"$f":"'2_Upravený'!D26-'1_Původní'!D26","v":40055.470165999999},{"$f":"'2_Upravený'!E26-'1_Původní'!E26","v":41666.666665999997},{"$f":"'2_Upravený'!F26-'1_Původní'!F26","v":41666.666665999997},{"$f":"'2_Upravený'!G26-'1_Původní'!G26","v":41666.666665999997},{"$f":"'2_Upravený'!H26-'1_Původní'!H26","v":41666.666665999997},{"$f":"'2_Upravený'!I26-'1_Původní'!I26","v":41666.666665999997},{"$f":"'2_Upravený'!J26-'1_Původní'!J26","v":41666.666665999997},{"$f":"'2_Upravený'!K26-'1_Původní'!K26","v":41666.666665999997},{"$f":"'2_Upravený'!L26-'1_Původní'!L26","v":41666.666665999997},{"$f":"'2_Upravený'!M26-'1_Původní'!M26","v":41666.666665999997},{"$f":"'2_Upravený'!N26-'1_Původní'!N26","v":41666.666665999997},{"$f":"'2_Upravený'!O26-'1_Původní'!O26","v":41666.666665999997},498388.80349199986]
[null,{"$f":"IF('2_Upravený'!B27=\"\",\"\",'2_Upravený'!B27)","v":"9204"},{"$f":"IF('2_Upravený'!C27=\"\",\"\",'2_Upravený'!C27)","v":"Areál FNOL"},{"$f":"'2_Upravený'!D27-'1_Původní'!D27","v":-13170.348900000001},{"$f":"'2_Upravený'!E27-'1_Původní'!E27","v":-9722.7374},{"$f":"'2_Upravený'!F27-'1_Původní'!F27","v":0},{"$f":"'2_Upravený'!G27-'1_Původní'!G27","v":-6657.8366999999998},{"$f":"'2_Upravený'!H27-'1_Původní'!H27","v":-11328.883099999999},{"$f":"'2_Upravený'!I27-'1_Původní'!I27","v":-60769.9784},{"$f":"'2_Upravený'!J27-'1_Původní'!J27","v":-21507.1083},{"$f":"'2_Upravený'!K27-'1_Původní'!K27","v":-46621.616199999997},{"$f":"'2_Upravený'!L27-'1_Původní'!L27","v":-9167.1524000000009},{"$f":"'2_Upravený'!M27-'1_Původní'!M27","v":-35315.232000000004},{"$f":"'2_Upravený'!N27-'1_Původní'!N27","v":-66802.896699999998},{"$f":"'2_Upravený'!O27-'1_Původní'!O27","v":-47095.700100000002},-328159.4902]
[null,{"$f":"IF('2_Upravený'!B28=\"\",\"\",'2_Upravený'!B28)","v":"9601"},{"$f":"IF('2_Upravený'!C28=\"\",\"\",'2_Upravený'!C28)","v":"Ubytovny"},{"$f":"'2_Upravený'!D28-'1_Původní'!D28","v":0},{"$f":"'2_Upravený'!E28-'1_Původní'!E28","v":0},{"$f":"'2_Upravený'!F28-'1_Původní'!F28","v":0},{"$f":"'2_Upravený'!G28-'1_Původní'!G28","v":0},{"$f":"'2_Upravený'!H28-'1_Původní'!H28","v":-2055.6644999999999},{"$f":"'2_Upravený'!I28-'1_Původní'!I28","v":-10556.1149},{"$f":"'2_Upravený'!J28-'1_Původní'!J28","v":0},{"$f":"'2_Upravený'!K28-'1_Původní'!K28","v":0},{"$f":"'2_Upravený'!L28-'1_Původní'!L28","v":0},{"$f":"'2_Upravený'!M28-'1_Původní'!M28","v":0},{"$f":"'2_Upravený'!N28-'1_Původní'!N28","v":0},{"$f":"'2_Upravený'!O28-'1_Původní'!O28","v":0},-12611.779399999999]
[null,{"$f":"IF('2_Upravený'!B29=\"\",\"\",'2_Upravený'!B29)","v":"9655"},{"$f":"IF('2_Upravený'!C29=\"\",\"\",'2_Upravený'!C29)","v":"Byty"},{"$f":"'2_Upravený'!D29-'1_Původní'!D29","v":0},{"$f":"'2_Upravený'!E29-'1_Původní'!E29","v":0},{"$f":"'2_Upravený'!F29-'1_Původní'!F29","v":-5833.6423999999997},{"$f":"'2_Upravený'!G29-'1_Původní'!G29","v":0},{"$f":"'2_Upravený'!H29-'1_Původní'!H29","v":0},{"$f":"'2_Upravený'!I29-'1_Původní'!I29","v":0},{"$f":"'2_Upravený'!J29-'1_Původní'!J29","v":0},{"$f":"'2_Upravený'!K29-'1_Původní'!K29","v":0},{"$f":"'2_Upravený'!L29-'1_Původní'!L29","v":0},{"$f":"'2_Upravený'!M29-'1_Původní'!M29","v":-4833.5893999999998},{"$f":"'2_Upravený'!N29-'1_Původní'!N29","v":-1750.0926999999999},{"$f":"'2_Upravený'!O29-'1_Původní'!O29","v":0},-12417.324499999999]
[null,{"$f":"IF('2_Upravený'!B30=\"\",\"\",'2_Upravený'!B30)","v":"9901"},{"$f":"IF('2_Upravený'!C30=\"\",\"\",'2_Upravený'!C30)","v":"Pronájmy Areál FNO"},{"$f":"'2_Upravený'!D30-'1_Původní'!D30","v":0},{"$f":"'2_Upravený'!E30-'1_Původní'!E30","v":0},{"$f":"'2_Upravený'!F30-'1_Původní'!F30","v":-1916.7682},{"$f":"'2_Upravený'!G30-'1_Původní'!G30","v":0},{"$f":"'2_Upravený'!H30-'1_Původní'!H30","v":0},{"$f":"'2_Upravený'!I30-'1_Původní'!I30","v":0},{"$f":"'2_Upravený'!J30-'1_Původní'!J30","v":0},{"$f":"'2_Upravený'!K30-'1_Původní'!K30","v":0},{"$f":"'2_Upravený'!L30-'1_Původní'!L30","v":0},{"$f":"'2_Upravený'!M30-'1_Původní'!M30","v":0},{"$f":"'2_Upravený'!N30-'1_Původní'!N30","v":0},{"$f":"'2_Upravený'!O30-'1_Původní'!O30","v":0},-1916.7682]
[null,{"$f":"IF('2_Upravený'!B31=\"\",\"\",'2_Upravený'!B31)","v":"9910"},{"$f":"IF('2_Upravený'!C31=\"\",\"\",'2_Upravený'!C31)","v":"Pronájmy Areál Hněvotínská vč.kotelny"},{"$f":"'2_Upravený'!D31-'1_Původní'!D31","v":-1111.17},{"$f":"'2_Upravený'!E31-'1_Původní'!E31","v":0},{"$f":"'2_Upravený'!F31-'1_Původní'!F31","v":0},{"$f":"'2_Upravený'!G31-'1_Původní'!G31","v":0},{"$f":"'2_Upravený'!H31-'1_Původní'!H31","v":0},{"$f":"'2_Upravený'!I31-'1_Původní'!I31","v":0},{"$f":"'2_Upravený'!J31-'1_Původní'!J31","v":-3277.9515000000001},{"$f":"'2_Upravený'!K31-'1_Původní'!K31","v":0},{"$f":"'2_Upravený'!L31-'1_Původní'!L31","v":0},{"$f":"'2_Upravený'!M31-'1_Původní'!M31","v":0},{"$f":"'2_Upravený'!N31-'1_Původní'!N31","v":0},{"$f":"'2_Upravený'!O31-'1_Původní'!O31","v":0},-4389.1215000000002]
[null,{"$f":"IF('2_Upravený'!B32=\"\",\"\",'2_Upravený'!B32)","v":""},{"$f":"IF('2_Upravený'!C32=\"\",\"\",'2_Upravený'!C32)","v":""},{"$f":"'2_Upravený'!D32-'1_Původní'!D32","v":0},{"$f":"'2_Upravený'!E32-'1_Původní'!E32","v":0},{"$f":"'2_Upravený'!F32-'1_Původní'!F32","v":0},{"$f":"'2_Upravený'!G32-'1_Původní'!G32","v":0},{"$f":"'2_Upravený'!H32-'1_Původní'!H32","v":0},{"$f":"'2_Upravený'!I32-'1_Původní'!I32","v":0},{"$f":"'2_Upravený'!J32-'1_Původní'!J32","v":0},{"$f":"'2_Upravený'!K32-'1_Původní'!K32","v":0},{"$f":"'2_Upravený'!L32-'1_Původní'!L32","v":0},{"$f":"'2_Upravený'!M32-'1_Původní'!M32","v":0},{"$f":"'2_Upravený'!N32-'1_Původní'!N32","v":0},{"$f":"'2_Upravený'!O32-'1_Původní'!O32","v":0},{"$f":"SUM(D32:O32)","v":0}]
[]
[51874001,"Ostatní služby - provozní",null,{"$f":"SUM(D100:D100)","v":0},0,0,0,0,0,0,0,0,0,0,0,0]
[null,{"$f":"IF('2_Upravený'!B35=\"\",\"\",'2_Upravený'!B35)","v":"0101"},{"$f":"IF('2_Upravený'!C35=\"\",\"\",'2_Upravený'!C35)","v":"Vedení klinického pracoviště"},{"$f":"'2_Upravený'!D35-'1_Původní'!D35","v":0},{"$f":"'2_Upravený'!E35-'1_Původní'!E35","v":0},{"$f":"'2_Upravený'!F35-'1_Původní'!F35","v":0},{"$f":"'2_Upravený'!G35-'1_Původní'!G35","v":0},{"$f":"'2_Upravený'!H35-'1_Původní'!H35","v":0},{"$f":"'2_Upravený'!I35-'1_Původní'!I35","v":0},{"$f":"'2_Upravený'!J35-'1_Původní'!J35","v":0},{"$f":"'2_Upravený'!K35-'1_Původní'!K35","v":0},{"$f":"'2_Upravený'!L35-'1_Původní'!L35","v":-743.65449999999998},{"$f":"'2_Upravený'!M35-'1_Původní'!M35","v":0},{"$f":"'2_Upravený'!N35-'1_Původní'!N35","v":0},{"$f":"'2_Upravený'!O35-'1_Původní'!O35","v":0},{"$f":"SUM(D35:O35)","v":-743.65449999999998}]
[null,{"$f":"IF('2_Upravený'!B36=\"\",\"\",'2_Upravený'!B36)","v":"0231"},{"$f":"IF('2_Upravený'!C36=\"\",\"\",'2_Upravený'!C36)","v":"JIP 30D"},{"$f":"'2_Upravený'!D36-'1_Původní'!D36","v":0},{"$f":"'2_Upravený'!E36-'1_Původní'!E36","v":0},{"$f":"'2_Upravený'!F36-'1_Původní'!F36","v":0},{"$f":"'2_Upravený'!G36-'1_Původní'!G36","v":0},{"$f":"'2_Upravený'!H36-'1_Původní'!H36","v":0},{"$f":"'2_Upravený'!I36-'1_Původní'!I36","v":0},{"$f":"'2_Upravený'!J36-'1_Původní'!J36","v":0},{"$f":"'2_Upravený'!K36-'1_Původní'!K36","v":0},{"$f":"'2_Upravený'!L36-'1_Původní'!L36","v":-11877.6497},{"$f":"'2_Upravený'!M36-'1_Původní'!M36","v":0},{"$f":"'2_Upravený'!N36-'1_Původní'!N36","v":0},{"$f":"'2_Upravený'!O36-'1_Původní'!O36","v":0},{"$f":"SUM(D36:O36)","v":-11877.6497}]
[null,{"$f":"IF('2_Upravený'!B37=\"\",\"\",'2_Upravený'!B37)","v":"0321"},{"$f":"IF('2_Upravený'!C37=\"\",\"\",'2_Upravený'!C37)","v":"Ambulance"},{"$f":"'2_Upravený'!D37-'1_Původní'!D37","v":0},{"$f":"'2_Upravený'!E37-'1_Původní'!E37","v":0},{"$f":"'2_Upravený'!F37-'1_Původní'!F37","v":0},{"$f":"'2_Upravený'!G37-'1_Původní'!G37","v":0},{"$f":"'2_Upravený'!H37-'1_Původní'!H37","v":0},{"$f":"'2_Upravený'!I37-'1_Původní'!I37","v":0},{"$f":"'2_Upravený'!J37-'1_Původní'!J37","v":0},{"$f":"'2_Upravený'!K37-'1_Původní'!K37","v":0},{"$f":"'2_Upravený'!L37-'1_Původní'!L37","v":0},{"$f":"'2_Upravený'!M37-'1_Původní'!M37","v":0},{"$f":"'2_Upravený'!N37-'1_Původní'!N37","v":-980.13660000000004},{"$f":"'2_Upravený'!O37-'1_Původní'!O37","v":0},-980.13660000000004]
[null,{"$f":"IF('2_Upravený'!B38=\"\",\"\",'2_Upravený'!B38)","v":"0801"},{"$f":"IF('2_Upravený'!C38=\"\",\"\",'2_Upravený'!C38)","v":"Vedení klinického pracoviště"},{"$f":"'2_Upravený'!D38-'1_Původní'!D38","v":-4957.6967000000004},{"$f":"'2_Upravený'!E38-'1_Původní'!E38","v":0},{"$f":"'2_Upravený'!F38-'1_Původní'!F38","v":0},{"$f":"'2_Upravený'!G38-'1_Původní'!G38","v":0},{"$f":"'2_Upravený'!H38-'1_Původní'!H38","v":0},{"$f":"'2_Upravený'!I38-'1_Původní'!I38","v":0},{"$f":"'2_Upravený'!J38-'1_Původní'!J38","v":-44.619300000000003},{"$f":"'2_Upravený'!K38-'1_Původní'!K38","v":0},{"$f":"'2_Upravený'!L38-'1_Původní'!L38","v":0},{"$f":"'2_Upravený'!M38-'1_Původní'!M38","v":0},{"$f":"'2_Upravený'!N38-'1_Původní'!N38","v":0},{"$f":"'2_Upravený'!O38-'1_Původní'!O38","v":0},-5002.3160000000007]
[null,{"$f":"IF('2_Upravený'!B39=\"\",\"\",'2_Upravený'!B39)","v":"1112"},{"$f":"IF('2_Upravený'!C39=\"\",\"\",'2_Upravený'!C39)","v":"Lůžkové oddělení 29B"},{"$f":"'2_Upravený'!D39-'1_Původní'!D39","v":0},{"$f":"'2_Upravený'!E39-'1_Původní'!E39","v":0},{"$f":"'2_Upravený'!F39-'1_Původní'!F39","v":0},{"$f":"'2_Upravený'!G39-'1_Původní'!G39","v":0},{"$f":"'2_Upravený'!H39-'1_Původní'!H39","v":0},{"$f":"'2_Upravený'!I39-'1_Původní'!I39","v":-74.365399999999994},{"$f":"'2_Upravený'!J39-'1_Původní'!J39","v":0},{"$f":"'2_Upravený'!K39-'1_Původní'!K39","v":0},{"$f":"'2_Upravený'!L39-'1_Původní'!L39","v":0},{"$f":"'2_Upravený'!M39-'1_Původní'!M39","v":0},{"$f":"'2_Upravený'!N39-'1_Původní'!N39","v":0},{"$f":"'2_Upravený'!O39-'1_Původní'!O39","v":0},-74.365399999999994]
[null,{"$f":"IF('2_Upravený'!B40=\"\",\"\",'2_Upravený'!B40)","v":"1704"},{"$f":"IF('2_Upravený'!C40=\"\",\"\",'2_Upravený'!C40)","v":"OP VVV - Molekulární, buněčný a klinický přístup ke zdravému stárnutí"},{"$f":"'2_Upravený'!D40-'1_Původní'!D40","v":50000},{"$f":"'2_Upravený'!E40-'1_Původní'!E40","v":50000},{"$f":"'2_Upravený'!F40-'1_Původní'!F40","v":50000},{"$f":"'2_Upravený'!G40-'1_Původní'!G40","v":50000},{"$f":"'2_Upravený'!H40-'1_Původní'!H40","v":50000},{"$f":"'2_Upravený'!I40-'1_Původní'!I40","v":50000},{"$f":"'2_Upravený'!J40-'1_Původní'!J40","v":50000},{"$f":"'2_Upravený'!K40-'1_Původní'!K40","v":50000},{"$f":"'2_Upravený'!L40-'1_Původní'!L40","v":49328.232100000001},{"$f":"'2_Upravený'!M40-'1_Původní'!M40","v":50000},{"$f":"'2_Upravený'!N40-'1_Původní'!N40","v":50000},{"$f":"'2_Upravený'!O40-'1_Původní'!O40","v":50000},599328.23210000002]
[null,{"$f":"IF('2_Upravený'!B41=\"\",\"\",'2_Upravený'!B41)","v":"2622"},{"$f":"IF('2_Upravený'!C41=\"\",\"\",'2_Upravený'!C41)","v":"RHC ambulance + kineziologie,kinezioterapie"},{"$f":"'2_Upravený'!D41-'1_Původní'!D41","v":0},{"$f":"'2_Upravený'!E41-'1_Původní'!E41","v":0},{"$f":"'2_Upravený'!F41-'1_Původní'!F41","v":0},{"$f":"'2_Upravený'!G41-'1_Původní'!G41","v":0},{"$f":"'2_Upravený'!H41-'1_Původní'!H41","v":0},{"$f":"'2_Upravený'!I41-'1_Původní'!I41","v":-371.8272},{"$f":"'2_Upravený'!J41-'1_Původní'!J41","v":0},{"$f":"'2_Upravený'!K41-'1_Původní'!K41","v":0},{"$f":"'2_Upravený'!L41-'1_Původní'!L41","v":0},{"$f":"'2_Upravený'!M41-'1_Původní'!M41","v":0},{"$f":"'2_Upravený'!N41-'1_Původní'!N41","v":0},{"$f":"'2_Upravený'!O41-'1_Původní'!O41","v":0},-371.8272]
[null,{"$f":"IF('2_Upravený'!B42=\"\",\"\",'2_Upravený'!B42)","v":"3341"},{"$f":"IF('2_Upravený'!C42=\"\",\"\",'2_Upravený'!C42)","v":"Centrální laboratoř"},{"$f":"'2_Upravený'!D42-'1_Původní'!D42","v":0},{"$f":"'2_Upravený'!E42-'1_Původní'!E42","v":0},{"$f":"'2_Upravený'!F42-'1_Původní'!F42","v":0},{"$f":"'2_Upravený'!G42-'1_Původní'!G42","v":0},{"$f":"'2_Upravený'!H42-'1_Původní'!H42","v":0},{"$f":"'2_Upravený'!I42-'1_Původní'!I42","v":0},{"$f":"'2_Upravený'!J42-'1_Původní'!J42","v":0},{"$f":"'2_Upravený'!K42-'1_Původní'!K42","v":0},{"$f":"'2_Upravený'!L42-'1_Původní'!L42","v":0},{"$f":"'2_Upravený'!M42-'1_Původní'!M42","v":0},{"$f":"'2_Upravený'!N42-'1_Původní'!N42","v":-4109.4348},{"$f":"'2_Upravený'!O42-'1_Původní'!O42","v":0},-4109.4348]
[null,{"$f":"IF('2_Upravený'!B43=\"\",\"\",'2_Upravený'!B43)","v":"3590"},{"$f":"IF('2_Upravený'!C43=\"\",\"\",'2_Upravený'!C43)","v":"Výroba"},{"$f":"'2_Upravený'!D43-'1_Původní'!D43","v":0},{"$f":"'2_Upravený'!E43-'1_Původní'!E43","v":0},{"$f":"'2_Upravený'!F43-'1_Původní'!F43","v":0},{"$f":"'2_Upravený'!G43-'1_Původní'!G43","v":0},{"$f":"'2_Upravený'!H43-'1_Původní'!H43","v":0},{"$f":"'2_Upravený'!I43-'1_Původní'!I43","v":0},{"$f":"'2_Upravený'!J43-'1_Původní'!J43","v":0},{"$f":"'2_Upravený'!K43-'1_Původní'!K43","v":0},{"$f":"'2_Upravený'!L43-'1_Původní'!L43","v":0},{"$f":"'2_Upravený'!M43-'1_Původní'!M43","v":0},{"$f":"'2_Upravený'!N43-'1_Původní'!N43","v":-849.25340000000006},{"$f":"'2_Upravený'!O43-'1_Původní'!O43","v":0},-849.25340000000006]
[null,{"$f":"IF('2_Upravený'!B44=\"\",\"\",'2_Upravený'!B44)","v":"4141"},{"$f":"IF('2_Upravený'!C44=\"\",\"\",'2_Upravený'!C44)","v":"Imunologie - laboratoř"},{"$f":"'2_Upravený'!D44-'1_Původní'!D44","v":-24895.073799999998},{"$f":"'2_Upravený'!E44-'1_Původní'!E44","v":0},{"$f":"'2_Upravený'!F44-'1_Původní'!F44","v":0},{"$f":"'2_Upravený'!G44-'1_Původní'!G44","v":0},{"$f":"'2_Upravený'!H44-'1_Původní'!H44","v":0},{"$f":"'2_Upravený'!I44-'1_Původní'!I44","v":0},{"$f":"'2_Upravený'!J44-'1_Původní'!J44","v":0},{"$f":"'2_Upravený'!K44-'1_Původní'!K44","v":0},{"$f":"'2_Upravený'!L44-'1_Původní'!L44","v":0},{"$f":"'2_Upravený'!M44-'1_Původní'!M44","v":0},{"$f":"'2_Upravený'!N44-'1_Původní'!N44","v":0},{"$f":"'2_Upravený'!O44-'1_Původní'!O44","v":0},-24895.073799999998]
[null,{"$f":"IF('2_Upravený'!B45=\"\",\"\",'2_Upravený'!B45)","v":"4764"},{"$f":"IF('2_Upravený'!C45=\"\",\"\",'2_Upravený'!C45)","v":"Centrální operační sály"},{"$f":"'2_Upravený'!D45-'1_Původní'!D45","v":0},{"$f":"'2_Upravený'!E45-'1_Původní'!E45","v":0},{"$f":"'2_Upravený'!F45-'1_Původní'!F45","v":0},{"$f":"'2_Upravený'!G45-'1_Původní'!G45","v":0},{"$f":"'2_Upravený'!H45-'1_Původní'!H45","v":0},{"$f":"'2_Upravený'!I45-'1_Původní'!I45","v":0},{"$f":"'2_Upravený'!J45-'1_Původní'!J45","v":0},{"$f":"'2_Upravený'!K45-'1_Původní'!K45","v":0},{"$f":"'2_Upravený'!L45-'1_Původní'!L45","v":-267.71559999999999},{"$f":"'2_Upravený'!M45-'1_Původní'!M45","v":0},{"$f":"'2_Upravený'!N45-'1_Původní'!N45","v":0},{"$f":"'2_Upravený'!O45-'1_Původní'!O45","v":0},-267.71559999999999]
[null,{"$f":"IF('2_Upravený'!B46=\"\",\"\",'2_Upravený'!B46)","v":"5693"},{"$f":"IF('2_Upravený'!C46=\"\",\"\",'2_Upravený'!C46)","v":"Oddělení centrální sterilizace"},{"$f":"'2_Upravený'!D46-'1_Původní'!D46","v":0},{"$f":"'2_Upravený'!E46-'1_Původní'!E46","v":0},{"$f":"'2_Upravený'!F46-'1_Původní'!F46","v":0},{"$f":"'2_Upravený'!G46-'1_Původní'!G46","v":0},{"$f":"'2_Upravený'!H46-'1_Původní'!H46","v":0},{"$f":"'2_Upravený'!I46-'1_Původní'!I46","v":0},{"$f":"'2_Upravený'!J46-'1_Původní'!J46","v":0},{"$f":"'2_Upravený'!K46-'1_Původní'!K46","v":0},{"$f":"'2_Upravený'!L46-'1_Původní'!L46","v":-1133.3295000000001},{"$f":"'2_Upravený'!M46-'1_Původní'!M46","v":0},{"$f":"'2_Upravený'!N46-'1_Původní'!N46","v":0},{"$f":"'2_Upravený'!O46-'1_Původní'!O46","v":0},-1133.3295000000001]
[null,{"$f":"IF('2_Upravený'!B47=\"\",\"\",'2_Upravený'!B47)","v":"8108"},{"$f":"IF('2_Upravený'!C47=\"\",\"\",'2_Upravený'!C47)","v":"Klinická hodnocení - Porodnicko-gynekologická klinika"},{"$f":"'2_Upravený'!D47-'1_Původní'!D47","v":0},{"$f":"'2_Upravený'!E47-'1_Původní'!E47","v":0},{"$f":"'2_Upravený'!F47-'1_Původní'!F47","v":0},{"$f":"'2_Upravený'!G47-'1_Původní'!G47","v":0},{"$f":"'2_Upravený'!H47-'1_Původní'!H47","v":0},{"$f":"'2_Upravený'!I47-'1_Původní'!I47","v":0},{"$f":"'2_Upravený'!J47-'1_Původní'!J47","v":0},{"$f":"'2_Upravený'!K47-'1_Původní'!K47","v":0},{"$f":"'2_Upravený'!L47-'1_Původní'!L47","v":0},{"$f":"'2_Upravený'!M47-'1_Původní'!M47","v":-3217.5450999999998},{"$f":"'2_Upravený'!N47-'1_Původní'!N47","v":0},{"$f":"'2_Upravený'!O47-'1_Původní'!O47","v":0},-3217.5450999999998]
[null,{"$f":"IF('2_Upravený'!B48=\"\",\"\",'2_Upravený'!B48)","v":"8121"},{"$f":"IF('2_Upravený'!C48=\"\",\"\",'2_Upravený'!C48)","v":"Klinická hodnocení - Onkologická klinika"},{"$f":"'2_Upravený'!D48-'1_Původní'!D48","v":0},{"$f":"'2_Upravený'!E48-'1_Původní'!E48","v":0},{"$f":"'2_Upravený'!F48-'1_Původní'!F48","v":0},{"$f":"'2_Upravený'!G48-'1_Původní'!G48","v":0},{"$f":"'2_Upravený'!H48-'1_Původní'!H48","v":0},{"$f":"'2_Upravený'!I48-'1_Původní'!I48","v":0},{"$f":"'2_Upravený'!J48-'1_Původní'!J48","v":0},{"$f":"'2_Upravený'!K48-'1_Původní'!K48","v":0},{"$f":"'2_Upravený'!L48-'1_Původní'!L48","v":0},{"$f":"'2_Upravený'!M48-'1_Původní'!M48","v":0},{"$f":"'2_Upravený'!N48-'1_Původní'!N48","v":-1239.4241999999999},{"$f":"'2_Upravený'!O48-'1_Původní'!O48","v":0},-1239.4241999999999]
[null,{"$f":"IF('2_Upravený'!B49=\"\",\"\",'2_Upravený'!B49)","v":"8507"},{"$f":"IF('2_Upravený'!C49=\"\",\"\",'2_Upravený'!C49)","v":"Prof. MUDr. Vítězslav Kolek, DrSc. - PLIC"},{"$f":"'2_Upravený'!D49-'1_Původní'!D49","v":0},{"$f":"'2_Upravený'!E49-'1_Původní'!E49","v":0},{"$f":"'2_Upravený'!F49-'1_Původní'!F49","v":0},{"$f":"'2_Upravený'!G49-'1_Původní'!G49","v":0},{"$f":"'2_Upravený'!H49-'1_Původní'!H49","v":0},{"$f":"'2_Upravený'!I49-'1_Původní'!I49","v":0},{"$f":"'2_Upravený'!J49-'1_Původní'!J49","v":0},{"$f":"'2_Upravený'!K49-'1_Původní'!K49","v":0},{"$f":"'2_Upravený'!L49-'1_Původní'!L49","v":-361.9119},{"$f":"'2_Upravený'!M49-'1_Původní'!M49","v":0},{"$f":"'2_Upravený'!N49-'1_Původní'!N49","v":0},{"$f":"'2_Upravený'!O49-'1_Původní'!O49","v":0},-361.9119]
[null,{"$f":"IF('2_Upravený'!B50=\"\",\"\",'2_Upravený'!B50)","v":"8509"},{"$f":"IF('2_Upravený'!C50=\"\",\"\",'2_Upravený'!C50)","v":"Doc. MUDr. Daniel Šaňák, PhD. - NEUROL"},{"$f":"'2_Upravený'!D50-'1_Původní'!D50","v":0},{"$f":"'2_Upravený'!E50-'1_Původní'!E50","v":0},{"$f":"'2_Upravený'!F50-'1_Původní'!F50","v":0},{"$f":"'2_Upravený'!G50-'1_Původní'!G50","v":0},{"$f":"'2_Upravený'!H50-'1_Původní'!H50","v":0},{"$f":"'2_Upravený'!I50-'1_Původní'!I50","v":0},{"$f":"'2_Upravený'!J50-'1_Původní'!J50","v":0},{"$f":"'2_Upravený'!K50-'1_Původní'!K50","v":0},{"$f":"'2_Upravený'!L50-'1_Původní'!L50","v":0},{"$f":"'2_Upravený'!M50-'1_Původní'!M50","v":-347.93119999999999},{"$f":"'2_Upravený'!N50-'1_Původní'!N50","v":0},{"$f":"'2_Upravený'!O50-'1_Původní'!O50","v":0},-347.93119999999999]
[null,{"$f":"IF('2_Upravený'!B51=\"\",\"\",'2_Upravený'!B51)","v":"8510"},{"$f":"IF('2_Upravený'!C51=\"\",\"\",'2_Upravený'!C51)","v":"Doc. MUDr. Petr Hamal, PhD. - MIKRO"},{"$f":"'2_Upravený'!D51-'1_Původní'!D51","v":0},{"$f":"'2_Upravený'!E51-'1_Původní'!E51","v":0},{"$f":"'2_Upravený'!F51-'1_Původní'!F51","v":0},{"$f":"'2_Upravený'!G51-'1_Původní'!G51","v":0},{"$f":"'2_Upravený'!H51-'1_Původní'!H51","v":0},{"$f":"'2_Upravený'!I51-'1_Původní'!I51","v":0},{"$f":"'2_Upravený'!J51-'1_Původní'!J51","v":-419.9169},{"$f":"'2_Upravený'!K51-'1_Původní'!K51","v":-6120.4996000000001},{"$f":"'2_Upravený'!L51-'1_Původní'!L51","v":0},{"$f":"'2_Upravený'!M51-'1_Původní'!M51","v":0},{"$f":"'2_Upravený'!N51-'1_Původní'!N51","v":-386.92340000000002},{"$f":"'2_Upravený'!O51-'1_Původní'!O51","v":0},-6927.3398999999999]
[null,{"$f":"IF('2_Upravený'!B52=\"\",\"\",'2_Upravený'!B52)","v":"8533"},{"$f":"IF('2_Upravený'!C52=\"\",\"\",'2_Upravený'!C52)","v":"MUDr. Milan Král, Ph.D. - UROL"},{"$f":"'2_Upravený'!D52-'1_Původní'!D52","v":0},{"$f":"'2_Upravený'!E52-'1_Původní'!E52","v":0},{"$f":"'2_Upravený'!F52-'1_Původní'!F52","v":0},{"$f":"'2_Upravený'!G52-'1_Původní'!G52","v":0},{"$f":"'2_Upravený'!H52-'1_Původní'!H52","v":0},{"$f":"'2_Upravený'!I52-'1_Původní'!I52","v":0},{"$f":"'2_Upravený'!J52-'1_Původní'!J52","v":0},{"$f":"'2_Upravený'!K52-'1_Původní'!K52","v":0},{"$f":"'2_Upravený'!L52-'1_Původní'!L52","v":0},{"$f":"'2_Upravený'!M52-'1_Původní'!M52","v":0},{"$f":"'2_Upravený'!N52-'1_Původní'!N52","v":-644.50059999999996},{"$f":"'2_Upravený'!O52-'1_Původní'!O52","v":0},-644.50059999999996]
[null,{"$f":"IF('2_Upravený'!B53=\"\",\"\",'2_Upravený'!B53)","v":"8541"},{"$f":"IF('2_Upravený'!C53=\"\",\"\",'2_Upravený'!C53)","v":"MUDr. Richard Salzman, Ph.D. - ORL"},{"$f":"'2_Upravený'!D53-'1_Původní'!D53","v":0},{"$f":"'2_Upravený'!E53-'1_Původní'!E53","v":0},{"$f":"'2_Upravený'!F53-'1_Původní'!F53","v":0},{"$f":"'2_Upravený'!G53-'1_Původní'!G53","v":0},{"$f":"'2_Upravený'!H53-'1_Původní'!H53","v":0},{"$f":"'2_Upravený'!I53-'1_Původní'!I53","v":0},{"$f":"'2_Upravený'!J53-'1_Původní'!J53","v":0},{"$f":"'2_Upravený'!K53-'1_Původní'!K53","v":0},{"$f":"'2_Upravený'!L53-'1_Původní'!L53","v":-14873.09},{"$f":"'2_Upravený'!M53-'1_Původní'!M53","v":0},{"$f":"'2_Upravený'!N53-'1_Původní'!N53","v":0},{"$f":"'2_Upravený'!O53-'1_Původní'!O53","v":0},-14873.09]
[null,{"$f":"IF('2_Upravený'!B54=\"\",\"\",'2_Upravený'!B54)","v":"8555"},{"$f":"IF('2_Upravený'!C54=\"\",\"\",'2_Upravený'!C54)","v":"Doc. RNDr. Radek Vrtěl, PhD. - GENETIKA"},{"$f":"'2_Upravený'!D54-'1_Původní'!D54","v":0},{"$f":"'2_Upravený'!E54-'1_Původní'!E54","v":0},{"$f":"'2_Upravený'!F54-'1_Původní'!F54","v":0},{"$f":"'2_Upravený'!G54-'1_Původní'!G54","v":0},{"$f":"'2_Upravený'!H54-'1_Původní'!H54","v":0},{"$f":"'2_Upravený'!I54-'1_Původní'!I54","v":0},{"$f":"'2_Upravený'!J54-'1_Původní'!J54","v":0},{"$f":"'2_Upravený'!K54-'1_Původní'!K54","v":-117.9932},{"$f":"'2_Upravený'!L54-'1_Původní'!L54","v":0},{"$f":"'2_Upravený'!M54-'1_Původní'!M54","v":-84.280799999999999},{"$f":"'2_Upravený'!N54-'1_Původní'!N54","v":-4957.6967000000004},{"$f":"'2_Upravený'!O54-'1_Původní'!O54","v":0},-5159.9707000000008]
[null,{"$f":"IF('2_Upravený'!B55=\"\",\"\",'2_Upravený'!B55)","v":"8556"},{"$f":"IF('2_Upravený'!C55=\"\",\"\",'2_Upravený'!C55)","v":"MUDr. Tomáš Veverka, PhD. - NEUROL"},{"$f":"'2_Upravený'!D55-'1_Původní'!D55","v":0},{"$f":"'2_Upravený'!E55-'1_Původní'!E55","v":0},{"$f":"'2_Upravený'!F55-'1_Původní'!F55","v":0},{"$f":"'2_Upravený'!G55-'1_Původní'!G55","v":-40394.028400000003},{"$f":"'2_Upravený'!H55-'1_Původní'!H55","v":0},{"$f":"'2_Upravený'!I55-'1_Původní'!I55","v":0},{"$f":"'2_Upravený'!J55-'1_Původní'!J55","v":-2190.8062},{"$f":"'2_Upravený'!K55-'1_Původní'!K55","v":0},{"$f":"'2_Upravený'!L55-'1_Původní'!L55","v":0},{"$f":"'2_Upravený'!M55-'1_Původní'!M55","v":-206.959},{"$f":"'2_Upravený'!N55-'1_Původní'!N55","v":0},{"$f":"'2_Upravený'!O55-'1_Původní'!O55","v":0},-42791.793600000005]
[null,{"$f":"IF('2_Upravený'!B56=\"\",\"\",'2_Upravený'!B56)","v":"8558"},{"$f":"IF('2_Upravený'!C56=\"\",\"\",'2_Upravený'!C56)","v":"MUDr. Filip Čtvrtlík, PhD. - RTG"},{"$f":"'2_Upravený'!D56-'1_Původní'!D56","v":0},{"$f":"'2_Upravený'!E56-'1_Původní'!E56","v":0},{"$f":"'2_Upravený'!F56-'1_Původní'!F56","v":0},{"$f":"'2_Upravený'!G56-'1_Původní'!G56","v":0},{"$f":"'2_Upravený'!H56-'1_Původní'!H56","v":0},{"$f":"'2_Upravený'!I56-'1_Původní'!I56","v":-3966.1572999999999},{"$f":"'2_Upravený'!J56-'1_Původní'!J56","v":0},{"$f":"'2_Upravený'!K56-'1_Původní'!K56","v":-22148.0141},{"$f":"'2_Upravený'!L56-'1_Původní'!L56","v":-4957.6967000000004},{"$f":"'2_Upravený'!M56-'1_Původní'!M56","v":0},{"$f":"'2_Upravený'!N56-'1_Původní'!N56","v":-3966.1572999999999},{"$f":"'2_Upravený'!O56-'1_Původní'!O56","v":0},-35038.025399999999]
[null,{"$f":"IF('2_Upravený'!B57=\"\",\"\",'2_Upravený'!B57)","v":"8559"},{"$f":"IF('2_Upravený'!C57=\"\",\"\",'2_Upravený'!C57)","v":"MUDr. JUDr. Dušan Klos, Ph.D. - I.CHIR"},{"$f":"'2_Upravený'!D57-'1_Původní'!D57","v":0},{"$f":"'2_Upravený'!E57-'1_Původní'!E57","v":0},{"$f":"'2_Upravený'!F57-'1_Původní'!F57","v":0},{"$f":"'2_Upravený'!G57-'1_Původní'!G57","v":0},{"$f":"'2_Upravený'!H57-'1_Původní'!H57","v":0},{"$f":"'2_Upravený'!I57-'1_Původní'!I57","v":0},{"$f":"'2_Upravený'!J57-'1_Původní'!J57","v":0},{"$f":"'2_Upravený'!K57-'1_Původní'!K57","v":0},{"$f":"'2_Upravený'!L57-'1_Původní'!L57","v":-3420.3148999999999},{"$f":"'2_Upravený'!M57-'1_Původní'!M57","v":0},{"$f":"'2_Upravený'!N57-'1_Původní'!N57","v":0},{"$f":"'2_Upravený'!O57-'1_Původní'!O57","v":0},-3420.3148999999999]
[null,{"$f":"IF('2_Upravený'!B58=\"\",\"\",'2_Upravený'!B58)","v":"8563"},{"$f":"IF('2_Upravený'!C58=\"\",\"\",'2_Upravený'!C58)","v":"Doc. MUDr. Jan Minařík, Ph.D. - HOK"},{"$f":"'2_Upravený'!D58-'1_Původní'!D58","v":0},{"$f":"'2_Upravený'!E58-'1_Původní'!E58","v":0},{"$f":"'2_Upravený'!F58-'1_Původní'!F58","v":0},{"$f":"'2_Upravený'!G58-'1_Původní'!G58","v":0},{"$f":"'2_Upravený'!H58-'1_Původní'!H58","v":0},{"$f":"'2_Upravený'!I58-'1_Původní'!I58","v":0},{"$f":"'2_Upravený'!J58-'1_Původní'!J58","v":0},{"$f":"'2_Upravený'!K58-'1_Původní'!K58","v":-719.85760000000005},{"$f":"'2_Upravený'!L58-'1_Původní'!L58","v":0},{"$f":"'2_Upravený'!M58-'1_Původní'!M58","v":0},{"$f":"'2_Upravený'!N58-'1_Původní'!N58","v":0},{"$f":"'2_Upravený'!O58-'1_Původní'!O58","v":0},-719.85760000000005]
[null,{"$f":"IF('2_Upravený'!B59=\"\",\"\",'2_Upravený'!B59)","v":"8565"},{"$f":"IF('2_Upravený'!C59=\"\",\"\",'2_Upravený'!C59)","v":"Prof. MUDr. Ing. Petr Hluštík, Ph.D. - NEUROL"},{"$f":"'2_Upravený'!D59-'1_Původní'!D59","v":0},{"$f":"'2_Upravený'!E59-'1_Původní'!E59","v":0},{"$f":"'2_Upravený'!F59-'1_Původní'!F59","v":0},{"$f":"'2_Upravený'!G59-'1_Původní'!G59","v":0},{"$f":"'2_Upravený'!H59-'1_Původní'!H59","v":0},{"$f":"'2_Upravený'!I59-'1_Původní'!I59","v":0},{"$f":"'2_Upravený'!J59-'1_Původní'!J59","v":0},{"$f":"'2_Upravený'!K59-'1_Původní'!K59","v":0},{"$f":"'2_Upravený'!L59-'1_Původní'!L59","v":0},{"$f":"'2_Upravený'!M59-'1_Původní'!M59","v":-1604.8063999999999},{"$f":"'2_Upravený'!N59-'1_Původní'!N59","v":0},{"$f":"'2_Upravený'!O59-'1_Původní'!O59","v":0},-1604.8063999999999]
[null,{"$f":"IF('2_Upravený'!B60=\"\",\"\",'2_Upravený'!B60)","v":"8709"},{"$f":"IF('2_Upravený'!C60=\"\",\"\",'2_Upravený'!C60)","v":"RIV: MUDr. Aleš Grambal, PhD."},{"$f":"'2_Upravený'!D60-'1_Původní'!D60","v":0},{"$f":"'2_Upravený'!E60-'1_Původní'!E60","v":0},{"$f":"'2_Upravený'!F60-'1_Původní'!F60","v":0},{"$f":"'2_Upravený'!G60-'1_Původní'!G60","v":0},{"$f":"'2_Upravený'!H60-'1_Původní'!H60","v":0},{"$f":"'2_Upravený'!I60-'1_Původní'!I60","v":0},{"$f":"'2_Upravený'!J60-'1_Původní'!J60","v":0},{"$f":"'2_Upravený'!K60-'1_Původní'!K60","v":0},{"$f":"'2_Upravený'!L60-'1_Původní'!L60","v":0},{"$f":"'2_Upravený'!M60-'1_Původní'!M60","v":0},{"$f":"'2_Upravený'!N60-'1_Původní'!N60","v":-38957.887799999997},{"$f":"'2_Upravený'!O60-'1_Původní'!O60","v":0},-38957.887799999997]
[null,{"$f":"IF('2_Upravený'!B61=\"\",\"\",'2_Upravený'!B61)","v":"8710"},{"$f":"IF('2_Upravený'!C61=\"\",\"\",'2_Upravený'!C61)","v":"RIV: MUDr. Štefan Trnka"},{"$f":"'2_Upravený'!D61-'1_Původní'!D61","v":0},{"$f":"'2_Upravený'!E61-'1_Původní'!E61","v":0},{"$f":"'2_Upravený'!F61-'1_Původní'!F61","v":0},{"$f":"'2_Upravený'!G61-'1_Původní'!G61","v":0},{"$f":"'2_Upravený'!H61-'1_Původní'!H61","v":0},{"$f":"'2_Upravený'!I61-'1_Původní'!I61","v":0},{"$f":"'2_Upravený'!J61-'1_Původní'!J61","v":-559.22820000000002},{"$f":"'2_Upravený'!K61-'1_Původní'!K61","v":-410.99310000000003},{"$f":"'2_Upravený'!L61-'1_Původní'!L61","v":0},{"$f":"'2_Upravený'!M61-'1_Původní'!M61","v":-21212.9925},{"$f":"'2_Upravený'!N61-'1_Původní'!N61","v":-3390.0729999999999},{"$f":"'2_Upravený'!O61-'1_Původní'!O61","v":0},-25573.286800000002]
[null,{"$f":"IF('2_Upravený'!B62=\"\",\"\",'2_Upravený'!B62)","v":"8712"},{"$f":"IF('2_Upravený'!C62=\"\",\"\",'2_Upravený'!C62)","v":"RIV: prof. MUDr. Jiří Gallo, PhD."},{"$f":"'2_Upravený'!D62-'1_Původní'!D62","v":0},{"$f":"'2_Upravený'!E62-'1_Původní'!E62","v":0},{"$f":"'2_Upravený'!F62-'1_Původní'!F62","v":0},{"$f":"'2_Upravený'!G62-'1_Původní'!G62","v":0},{"$f":"'2_Upravený'!H62-'1_Původní'!H62","v":0},{"$f":"'2_Upravený'!I62-'1_Původní'!I62","v":0},{"$f":"'2_Upravený'!J62-'1_Původní'!J62","v":0},{"$f":"'2_Upravený'!K62-'1_Původní'!K62","v":0},{"$f":"'2_Upravený'!L62-'1_Původní'!L62","v":-31134.3351},{"$f":"'2_Upravený'!M62-'1_Původní'!M62","v":0},{"$f":"'2_Upravený'!N62-'1_Původní'!N62","v":0},{"$f":"'2_Upravený'!O62-'1_Původní'!O62","v":0},-31134.3351]
[null,{"$f":"IF('2_Upravený'!B63=\"\",\"\",'2_Upravený'!B63)","v":"8715"},{"$f":"IF('2_Upravený'!C63=\"\",\"\",'2_Upravený'!C63)","v":"RIV: MUDr. Karel Huml"},{"$f":"'2_Upravený'!D63-'1_Původní'!D63","v":0},{"$f":"'2_Upravený'!E63-'1_Původní'!E63","v":0},{"$f":"'2_Upravený'!F63-'1_Původní'!F63","v":0},{"$f":"'2_Upravený'!G63-'1_Původní'!G63","v":0},{"$f":"'2_Upravený'!H63-'1_Původní'!H63","v":0},{"$f":"'2_Upravený'!I63-'1_Původní'!I63","v":0},{"$f":"'2_Upravený'!J63-'1_Původní'!J63","v":0},{"$f":"'2_Upravený'!K63-'1_Původní'!K63","v":0},{"$f":"'2_Upravený'!L63-'1_Původní'!L63","v":0},{"$f":"'2_Upravený'!M63-'1_Původní'!M63","v":0},{"$f":"'2_Upravený'!N63-'1_Původní'!N63","v":-46653.536899999999},{"$f":"'2_Upravený'!O63-'1_Původní'!O63","v":0},-46653.536899999999]
[null,{"$f":"IF('2_Upravený'!B64=\"\",\"\",'2_Upravený'!B64)","v":"8716"},{"$f":"IF('2_Upravený'!C64=\"\",\"\",'2_Upravený'!C64)","v":"RIV: MUDr. Beáta Hutyrová, PhD."},{"$f":"'2_Upravený'!D64-'1_Původní'!D64","v":0},{"$f":"'2_Upravený'!E64-'1_Původní'!E64","v":0},{"$f":"'2_Upravený'!F64-'1_Původní'!F64","v":0},{"$f":"'2_Upravený'!G64-'1_Původní'!G64","v":0},{"$f":"'2_Upravený'!H64-'1_Původní'!H64","v":0},{"$f":"'2_Upravený'!I64-'1_Původní'!I64","v":0},{"$f":"'2_Upravený'!J64-'1_Původní'!J64","v":0},{"$f":"'2_Upravený'!K64-'1_Původní'!K64","v":0},{"$f":"'2_Upravený'!L64-'1_Původní'!L64","v":-491.80349999999999},{"$f":"'2_Upravený'!M64-'1_Původní'!M64","v":0},{"$f":"'2_Upravený'!N64-'1_Původní'!N64","v":0},{"$f":"'2_Upravený'!O64-'1_Původní'!O64","v":0},-491.80349999999999]
[null,{"$f":"IF('2_Upravený'!B65=\"\",\"\",'2_Upravený'!B65)","v":"8720"},{"$f":"IF('2_Upravený'!C65=\"\",\"\",'2_Upravený'!C65)","v":"RIV: MUDr. Petr Kolář, PhD."},{"$f":"'2_Upravený'!D65-'1_Původní'!D65","v":0},{"$f":"'2_Upravený'!E65-'1_Původní'!E65","v":0},{"$f":"'2_Upravený'!F65-'1_Původní'!F65","v":0},{"$f":"'2_Upravený'!G65-'1_Původní'!G65","v":-2943.3845000000001},{"$f":"'2_Upravený'!H65-'1_Původní'!H65","v":0},{"$f":"'2_Upravený'!I65-'1_Původní'!I65","v":0},{"$f":"'2_Upravený'!J65-'1_Původní'!J65","v":0},{"$f":"'2_Upravený'!K65-'1_Původní'!K65","v":0},{"$f":"'2_Upravený'!L65-'1_Původní'!L65","v":-760.64949999999999},{"$f":"'2_Upravený'!M65-'1_Původní'!M65","v":0},{"$f":"'2_Upravený'!N65-'1_Původní'!N65","v":0},{"$f":"'2_Upravený'!O65-'1_Původní'!O65","v":0},-3704.0340000000001]
[null,{"$f":"IF('2_Upravený'!B66=\"\",\"\",'2_Upravený'!B66)","v":"8721"},{"$f":"IF('2_Upravený'!C66=\"\",\"\",'2_Upravený'!C66)","v":"RIV: MUDr. Andrea Smržová"},{"$f":"'2_Upravený'!D66-'1_Původní'!D66","v":0},{"$f":"'2_Upravený'!E66-'1_Původní'!E66","v":0},{"$f":"'2_Upravený'!F66-'1_Původní'!F66","v":0},{"$f":"'2_Upravený'!G66-'1_Původní'!G66","v":0},{"$f":"'2_Upravený'!H66-'1_Původní'!H66","v":0},{"$f":"'2_Upravený'!I66-'1_Původní'!I66","v":-15362.96},{"$f":"'2_Upravený'!J66-'1_Původní'!J66","v":0},{"$f":"'2_Upravený'!K66-'1_Původní'!K66","v":0},{"$f":"'2_Upravený'!L66-'1_Původní'!L66","v":-991.04359999999997},{"$f":"'2_Upravený'!M66-'1_Původní'!M66","v":0},{"$f":"'2_Upravený'!N66-'1_Původní'!N66","v":0},{"$f":"'2_Upravený'!O66-'1_Původní'!O66","v":0},-16354.0036]
[null,{"$f":"IF('2_Upravený'!B67=\"\",\"\",'2_Upravený'!B67)","v":"8725"},{"$f":"IF('2_Upravený'!C67=\"\",\"\",'2_Upravený'!C67)","v":"RIV: MUDr. Helena Urbánková"},{"$f":"'2_Upravený'!D67-'1_Původní'!D67","v":0},{"$f":"'2_Upravený'!E67-'1_Původní'!E67","v":0},{"$f":"'2_Upravený'!F67-'1_Původní'!F67","v":0},{"$f":"'2_Upravený'!G67-'1_Původní'!G67","v":0},{"$f":"'2_Upravený'!H67-'1_Původní'!H67","v":-233.2398},{"$f":"'2_Upravený'!I67-'1_Původní'!I67","v":0},{"$f":"'2_Upravený'!J67-'1_Původní'!J67","v":-864.12649999999996},{"$f":"'2_Upravený'!K67-'1_Původní'!K67","v":0},{"$f":"'2_Upravený'!L67-'1_Původní'!L67","v":-9714.8742999999995},{"$f":"'2_Upravený'!M67-'1_Původní'!M67","v":-432.31110000000001},{"$f":"'2_Upravený'!N67-'1_Původní'!N67","v":0},{"$f":"'2_Upravený'!O67-'1_Původní'!O67","v":-2289.0279999999998},-13533.5797]
[null,{"$f":"IF('2_Upravený'!B68=\"\",\"\",'2_Upravený'!B68)","v":"8753"},{"$f":"IF('2_Upravený'!C68=\"\",\"\",'2_Upravený'!C68)","v":"RIV: MUDr. Richard Salzmann, Ph.D."},{"$f":"'2_Upravený'!D68-'1_Původní'!D68","v":0},{"$f":"'2_Upravený'!E68-'1_Původní'!E68","v":0},{"$f":"'2_Upravený'!F68-'1_Původní'!F68","v":0},{"$f":"'2_Upravený'!G68-'1_Původní'!G68","v":-4957.6967000000004},{"$f":"'2_Upravený'!H68-'1_Původní'!H68","v":0},{"$f":"'2_Upravený'!I68-'1_Původní'!I68","v":0},{"$f":"'2_Upravený'!J68-'1_Původní'!J68","v":0},{"$f":"'2_Upravený'!K68-'1_Původní'!K68","v":0},{"$f":"'2_Upravený'!L68-'1_Původní'!L68","v":0},{"$f":"'2_Upravený'!M68-'1_Původní'!M68","v":0},{"$f":"'2_Upravený'!N68-'1_Původní'!N68","v":0},{"$f":"'2_Upravený'!O68-'1_Původní'!O68","v":0},-4957.6967000000004]
[null,{"$f":"IF('2_Upravený'!B69=\"\",\"\",'2_Upravený'!B69)","v":"8755"},{"$f":"IF('2_Upravený'!C69=\"\",\"\",'2_Upravený'!C69)","v":"RIV - MUDr. Roman Hájek, Ph. D."},{"$f":"'2_Upravený'!D69-'1_Původní'!D69","v":0},{"$f":"'2_Upravený'!E69-'1_Původní'!E69","v":0},{"$f":"'2_Upravený'!F69-'1_Původní'!F69","v":0},{"$f":"'2_Upravený'!G69-'1_Původní'!G69","v":0},{"$f":"'2_Upravený'!H69-'1_Původní'!H69","v":-14112.202499999999},{"$f":"'2_Upravený'!I69-'1_Původní'!I69","v":0},{"$f":"'2_Upravený'!J69-'1_Původní'!J69","v":-551.79160000000002},{"$f":"'2_Upravený'!K69-'1_Původní'!K69","v":0},{"$f":"'2_Upravený'!L69-'1_Původní'!L69","v":0},{"$f":"'2_Upravený'!M69-'1_Původní'!M69","v":0},{"$f":"'2_Upravený'!N69-'1_Původní'!N69","v":0},{"$f":"'2_Upravený'!O69-'1_Původní'!O69","v":0},-14663.9941]
[null,{"$f":"IF('2_Upravený'!B70=\"\",\"\",'2_Upravený'!B70)","v":"8760"},{"$f":"IF('2_Upravený'!C70=\"\",\"\",'2_Upravený'!C70)","v":"RIV: RNDr. Martin Novák, Ph.D."},{"$f":"'2_Upravený'!D70-'1_Původní'!D70","v":0},{"$f":"'2_Upravený'!E70-'1_Původní'!E70","v":0},{"$f":"'2_Upravený'!F70-'1_Původní'!F70","v":0},{"$f":"'2_Upravený'!G70-'1_Původní'!G70","v":0},{"$f":"'2_Upravený'!H70-'1_Původní'!H70","v":0},{"$f":"'2_Upravený'!I70-'1_Původní'!I70","v":-359.92880000000002},{"$f":"'2_Upravený'!J70-'1_Původní'!J70","v":0},{"$f":"'2_Upravený'!K70-'1_Původní'!K70","v":0},{"$f":"'2_Upravený'!L70-'1_Původní'!L70","v":0},{"$f":"'2_Upravený'!M70-'1_Původní'!M70","v":0},{"$f":"'2_Upravený'!N70-'1_Původní'!N70","v":-26994.658299999999},{"$f":"'2_Upravený'!O70-'1_Původní'!O70","v":-1689.8061},-29044.393200000002]
[null,{"$f":"IF('2_Upravený'!B71=\"\",\"\",'2_Upravený'!B71)","v":"8762"},{"$f":"IF('2_Upravený'!C71=\"\",\"\",'2_Upravený'!C71)","v":"RIV - Doc. MUDr. David Karásek, Ph. D."},{"$f":"'2_Upravený'!D71-'1_Původní'!D71","v":-9915.3932999999997},{"$f":"'2_Upravený'!E71-'1_Původní'!E71","v":0},{"$f":"'2_Upravený'!F71-'1_Původní'!F71","v":-4957.6967000000004},{"$f":"'2_Upravený'!G71-'1_Původní'!G71","v":0},{"$f":"'2_Upravený'!H71-'1_Původní'!H71","v":0},{"$f":"'2_Upravený'!I71-'1_Původní'!I71","v":0},{"$f":"'2_Upravený'!J71-'1_Původní'!J71","v":0},{"$f":"'2_Upravený'!K71-'1_Původní'!K71","v":-9518.7775999999994},{"$f":"'2_Upravený'!L71-'1_Původní'!L71","v":0},{"$f":"'2_Upravený'!M71-'1_Původní'!M71","v":-3905.3512000000001},{"$f":"'2_Upravený'!N71-'1_Původní'!N71","v":-5475.9494999999997},{"$f":"'2_Upravený'!O71-'1_Původní'!O71","v":0},-33773.168299999998]
[null,{"$f":"IF('2_Upravený'!B72=\"\",\"\",'2_Upravený'!B72)","v":"8767"},{"$f":"IF('2_Upravený'!C72=\"\",\"\",'2_Upravený'!C72)","v":"RIV - Prof. MUDr. Jiří Gallo, Ph. D."},{"$f":"'2_Upravený'!D72-'1_Původní'!D72","v":0},{"$f":"'2_Upravený'!E72-'1_Původní'!E72","v":0},{"$f":"'2_Upravený'!F72-'1_Původní'!F72","v":0},{"$f":"'2_Upravený'!G72-'1_Původní'!G72","v":0},{"$f":"'2_Upravený'!H72-'1_Původní'!H72","v":0},{"$f":"'2_Upravený'!I72-'1_Původní'!I72","v":0},{"$f":"'2_Upravený'!J72-'1_Původní'!J72","v":-9756.7469999999994},{"$f":"'2_Upravený'!K72-'1_Původní'!K72","v":-21560.77},{"$f":"'2_Upravený'!L72-'1_Původní'!L72","v":0},{"$f":"'2_Upravený'!M72-'1_Původní'!M72","v":0},{"$f":"'2_Upravený'!N72-'1_Původní'!N72","v":-4799.0504000000001},{"$f":"'2_Upravený'!O72-'1_Původní'!O72","v":0},-36116.5674]
[null,{"$f":"IF('2_Upravený'!B73=\"\",\"\",'2_Upravený'!B73)","v":"8768"},{"$f":"IF('2_Upravený'!C73=\"\",\"\",'2_Upravený'!C73)","v":"RIV - Doc. MUDr. Karel Krejčí, Ph. D."},{"$f":"'2_Upravený'!D73-'1_Původní'!D73","v":0},{"$f":"'2_Upravený'!E73-'1_Původní'!E73","v":0},{"$f":"'2_Upravený'!F73-'1_Původní'!F73","v":0},{"$f":"'2_Upravený'!G73-'1_Původní'!G73","v":0},{"$f":"'2_Upravený'!H73-'1_Původní'!H73","v":0},{"$f":"'2_Upravený'!I73-'1_Původní'!I73","v":0},{"$f":"'2_Upravený'!J73-'1_Původní'!J73","v":0},{"$f":"'2_Upravený'!K73-'1_Původní'!K73","v":0},{"$f":"'2_Upravený'!L73-'1_Původní'!L73","v":0},{"$f":"'2_Upravený'!M73-'1_Původní'!M73","v":0},{"$f":"'2_Upravený'!N73-'1_Původní'!N73","v":-12070.5041},{"$f":"'2_Upravený'!O73-'1_Původní'!O73","v":0},-12070.5041]
[null,{"$f":"IF('2_Upravený'!B74=\"\",\"\",'2_Upravený'!B74)","v":"8773"},{"$f":"IF('2_Upravený'!C74=\"\",\"\",'2_Upravený'!C74)","v":"RIV - MUDr. Jan Hálek, Ph.D."},{"$f":"'2_Upravený'!D74-'1_Původní'!D74","v":0},{"$f":"'2_Upravený'!E74-'1_Původní'!E74","v":0},{"$f":"'2_Upravený'!F74-'1_Původní'!F74","v":0},{"$f":"'2_Upravený'!G74-'1_Původní'!G74","v":0},{"$f":"'2_Upravený'!H74-'1_Původní'!H74","v":0},{"$f":"'2_Upravený'!I74-'1_Původní'!I74","v":-24788.4833},{"$f":"'2_Upravený'!J74-'1_Původní'!J74","v":0},{"$f":"'2_Upravený'!K74-'1_Původní'!K74","v":0},{"$f":"'2_Upravený'!L74-'1_Původní'!L74","v":0},{"$f":"'2_Upravený'!M74-'1_Původní'!M74","v":0},{"$f":"'2_Upravený'!N74-'1_Původní'!N74","v":0},{"$f":"'2_Upravený'!O74-'1_Původní'!O74","v":0},-24788.4833]
[null,{"$f":"IF('2_Upravený'!B75=\"\",\"\",'2_Upravený'!B75)","v":"8780"},{"$f":"IF('2_Upravený'!C75=\"\",\"\",'2_Upravený'!C75)","v":"RIV - MUDr. Eva Karásková"},{"$f":"'2_Upravený'!D75-'1_Původní'!D75","v":0},{"$f":"'2_Upravený'!E75-'1_Původní'!E75","v":-3878.9018999999998},{"$f":"'2_Upravený'!F75-'1_Původní'!F75","v":0},{"$f":"'2_Upravený'!G75-'1_Původní'!G75","v":0},{"$f":"'2_Upravený'!H75-'1_Původní'!H75","v":0},{"$f":"'2_Upravený'!I75-'1_Původní'!I75","v":0},{"$f":"'2_Upravený'!J75-'1_Původní'!J75","v":0},{"$f":"'2_Upravený'!K75-'1_Původní'!K75","v":-330.18259999999998},{"$f":"'2_Upravený'!L75-'1_Původní'!L75","v":-2160.5641999999998},{"$f":"'2_Upravený'!M75-'1_Původní'!M75","v":0},{"$f":"'2_Upravený'!N75-'1_Původní'!N75","v":-1933.5017},{"$f":"'2_Upravený'!O75-'1_Původní'!O75","v":0},-8303.1504000000004]
[null,{"$f":"IF('2_Upravený'!B76=\"\",\"\",'2_Upravený'!B76)","v":"8781"},{"$f":"IF('2_Upravený'!C76=\"\",\"\",'2_Upravený'!C76)","v":"RIV - Doc. MUDr. Jiří Minařík, Ph. D."},{"$f":"'2_Upravený'!D76-'1_Původní'!D76","v":0},{"$f":"'2_Upravený'!E76-'1_Původní'!E76","v":0},{"$f":"'2_Upravený'!F76-'1_Původní'!F76","v":-24788.4833},{"$f":"'2_Upravený'!G76-'1_Původní'!G76","v":-378.27229999999997},{"$f":"'2_Upravený'!H76-'1_Původní'!H76","v":0},{"$f":"'2_Upravený'!I76-'1_Původní'!I76","v":0},{"$f":"'2_Upravený'!J76-'1_Původní'!J76","v":0},{"$f":"'2_Upravený'!K76-'1_Původní'!K76","v":-719.85760000000005},{"$f":"'2_Upravený'!L76-'1_Původní'!L76","v":-1900.1660999999999},{"$f":"'2_Upravený'!M76-'1_Původní'!M76","v":0},{"$f":"'2_Upravený'!N76-'1_Původní'!N76","v":-899.82190000000003},{"$f":"'2_Upravený'!O76-'1_Původní'!O76","v":0},-28686.601199999997]
[null,{"$f":"IF('2_Upravený'!B77=\"\",\"\",'2_Upravený'!B77)","v":"8782"},{"$f":"IF('2_Upravený'!C77=\"\",\"\",'2_Upravený'!C77)","v":"RIV - RNDr. Pavlína Čapková, Ph. D."},{"$f":"'2_Upravený'!D77-'1_Původní'!D77","v":0},{"$f":"'2_Upravený'!E77-'1_Původní'!E77","v":0},{"$f":"'2_Upravený'!F77-'1_Původní'!F77","v":-14037.222299999999},{"$f":"'2_Upravený'!G77-'1_Původní'!G77","v":0},{"$f":"'2_Upravený'!H77-'1_Původní'!H77","v":0},{"$f":"'2_Upravený'!I77-'1_Původní'!I77","v":0},{"$f":"'2_Upravený'!J77-'1_Původní'!J77","v":-378.27229999999997},{"$f":"'2_Upravený'!K77-'1_Původní'!K77","v":0},{"$f":"'2_Upravený'!L77-'1_Původní'!L77","v":0},{"$f":"'2_Upravený'!M77-'1_Původní'!M77","v":-15479.798000000001},{"$f":"'2_Upravený'!N77-'1_Původní'!N77","v":0},{"$f":"'2_Upravený'!O77-'1_Původní'!O77","v":0},-29895.292600000001]
[null,{"$f":"IF('2_Upravený'!B78=\"\",\"\",'2_Upravený'!B78)","v":"8783"},{"$f":"IF('2_Upravený'!C78=\"\",\"\",'2_Upravený'!C78)","v":"RIV - MUDr. Eva Klásková, Ph. D."},{"$f":"'2_Upravený'!D78-'1_Původní'!D78","v":0},{"$f":"'2_Upravený'!E78-'1_Původní'!E78","v":0},{"$f":"'2_Upravený'!F78-'1_Původní'!F78","v":0},{"$f":"'2_Upravený'!G78-'1_Původní'!G78","v":0},{"$f":"'2_Upravený'!H78-'1_Původní'!H78","v":-358.93720000000002},{"$f":"'2_Upravený'!I78-'1_Původní'!I78","v":0},{"$f":"'2_Upravený'!J78-'1_Původní'!J78","v":0},{"$f":"'2_Upravený'!K78-'1_Původní'!K78","v":0},{"$f":"'2_Upravený'!L78-'1_Původní'!L78","v":-4957.6967000000004},{"$f":"'2_Upravený'!M78-'1_Původní'!M78","v":-4773.7660999999998},{"$f":"'2_Upravený'!N78-'1_Původní'!N78","v":0},{"$f":"'2_Upravený'!O78-'1_Původní'!O78","v":0},-10090.400000000001]
[null,{"$f":"IF('2_Upravený'!B79=\"\",\"\",'2_Upravený'!B79)","v":"8785"},{"$f":"IF('2_Upravený'!C79=\"\",\"\",'2_Upravený'!C79)","v":"RIV - Doc. MUDr. Martin Hutyra, Ph. D."},{"$f":"'2_Upravený'!D79-'1_Původní'!D79","v":0},{"$f":"'2_Upravený'!E79-'1_Původní'!E79","v":0},{"$f":"'2_Upravený'!F79-'1_Původní'!F79","v":0},{"$f":"'2_Upravený'!G79-'1_Původní'!G79","v":0},{"$f":"'2_Upravený'!H79-'1_Původní'!H79","v":0},{"$f":"'2_Upravený'!I79-'1_Původní'!I79","v":0},{"$f":"'2_Upravený'!J79-'1_Původní'!J79","v":0},{"$f":"'2_Upravený'!K79-'1_Původní'!K79","v":0},{"$f":"'2_Upravený'!L79-'1_Původní'!L79","v":-7436.5450000000001},{"$f":"'2_Upravený'!M79-'1_Původní'!M79","v":0},{"$f":"'2_Upravený'!N79-'1_Původní'!N79","v":0},{"$f":"'2_Upravený'!O79-'1_Původní'!O79","v":0},-7436.5450000000001]
[null,{"$f":"IF('2_Upravený'!B80=\"\",\"\",'2_Upravený'!B80)","v":"8786"},{"$f":"IF('2_Upravený'!C80=\"\",\"\",'2_Upravený'!C80)","v":"RIV - MUDr. Pavel Hok"},{"$f":"'2_Upravený'!D80-'1_Původní'!D80","v":0},{"$f":"'2_Upravený'!E80-'1_Původní'!E80","v":0},{"$f":"'2_Upravený'!F80-'1_Původní'!F80","v":0},{"$f":"'2_Upravený'!G80-'1_Původní'!G80","v":0},{"$f":"'2_Upravený'!H80-'1_Původní'!H80","v":0},{"$f":"'2_Upravený'!I80-'1_Původní'!I80","v":0},{"$f":"'2_Upravený'!J80-'1_Původní'!J80","v":-39700.322699999997},{"$f":"'2_Upravený'!K80-'1_Původní'!K80","v":0},{"$f":"'2_Upravený'!L80-'1_Původní'!L80","v":0},{"$f":"'2_Upravený'!M80-'1_Původní'!M80","v":0},{"$f":"'2_Upravený'!N80-'1_Původní'!N80","v":0},{"$f":"'2_Upravený'!O80-'1_Původní'!O80","v":0},-39700.322699999997]
[null,{"$f":"IF('2_Upravený'!B81=\"\",\"\",'2_Upravený'!B81)","v":"8787"},{"$f":"IF('2_Upravený'!C81=\"\",\"\",'2_Upravený'!C81)","v":"RIV - Dr. Gvansta Kharaishvili, Ph. D."},{"$f":"'2_Upravený'!D81-'1_Původní'!D81","v":0},{"$f":"'2_Upravený'!E81-'1_Původní'!E81","v":0},{"$f":"'2_Upravený'!F81-'1_Původní'!F81","v":0},{"$f":"'2_Upravený'!G81-'1_Původní'!G81","v":-24788.4833},{"$f":"'2_Upravený'!H81-'1_Původní'!H81","v":0},{"$f":"'2_Upravený'!I81-'1_Původní'!I81","v":0},{"$f":"'2_Upravený'!J81-'1_Původní'!J81","v":0},{"$f":"'2_Upravený'!K81-'1_Původní'!K81","v":-576.08439999999996},{"$f":"'2_Upravený'!L81-'1_Původní'!L81","v":0},{"$f":"'2_Upravený'!M81-'1_Původní'!M81","v":0},{"$f":"'2_Upravený'!N81-'1_Původní'!N81","v":0},{"$f":"'2_Upravený'!O81-'1_Původní'!O81","v":0},-25364.5677]
[null,{"$f":"IF('2_Upravený'!B82=\"\",\"\",'2_Upravený'!B82)","v":"8791"},{"$f":"IF('2_Upravený'!C82=\"\",\"\",'2_Upravený'!C82)","v":"RIV - Doc. Mgr. Luděk Slavík, Ph. D. - MEX"},{"$f":"'2_Upravený'!D82-'1_Původní'!D82","v":0},{"$f":"'2_Upravený'!E82-'1_Původní'!E82","v":0},{"$f":"'2_Upravený'!F82-'1_Původní'!F82","v":-1007.8997000000001},{"$f":"'2_Upravený'!G82-'1_Původní'!G82","v":-1580.5137},{"$f":"'2_Upravený'!H82-'1_Původní'!H82","v":0},{"$f":"'2_Upravený'!I82-'1_Původní'!I82","v":-1320.7303999999999},{"$f":"'2_Upravený'!J82-'1_Původní'!J82","v":-838.84230000000002},{"$f":"'2_Upravený'!K82-'1_Původní'!K82","v":-16773.320599999999},{"$f":"'2_Upravený'!L82-'1_Původní'!L82","v":-245.90180000000001},{"$f":"'2_Upravený'!M82-'1_Původní'!M82","v":-4980.9978000000001},{"$f":"'2_Upravený'!N82-'1_Původní'!N82","v":0},{"$f":"'2_Upravený'!O82-'1_Původní'!O82","v":0},-26748.206300000002]
[null,{"$f":"IF('2_Upravený'!B83=\"\",\"\",'2_Upravený'!B83)","v":"8792"},{"$f":"IF('2_Upravený'!C83=\"\",\"\",'2_Upravený'!C83)","v":"RIV - Prof. MUDr. Jiří Gallo, Ph. D. - MEX"},{"$f":"'2_Upravený'!D83-'1_Původní'!D83","v":-4799.0504000000001},{"$f":"'2_Upravený'!E83-'1_Původní'!E83","v":0},{"$f":"'2_Upravený'!F83-'1_Původní'!F83","v":0},{"$f":"'2_Upravený'!G83-'1_Původní'!G83","v":0},{"$f":"'2_Upravený'!H83-'1_Původní'!H83","v":0},{"$f":"'2_Upravený'!I83-'1_Původní'!I83","v":-1421.2526},{"$f":"'2_Upravený'!J83-'1_Původní'!J83","v":0},{"$f":"'2_Upravený'!K83-'1_Původní'!K83","v":-980.63239999999996},{"$f":"'2_Upravený'!L83-'1_Původní'!L83","v":-13508.8112},{"$f":"'2_Upravený'!M83-'1_Původní'!M83","v":-432.31110000000001},{"$f":"'2_Upravený'!N83-'1_Původní'!N83","v":-6009.8190999999997},{"$f":"'2_Upravený'!O83-'1_Původní'!O83","v":0},-27151.876799999998]
[null,{"$f":"IF('2_Upravený'!B84=\"\",\"\",'2_Upravený'!B84)","v":"8794"},{"$f":"IF('2_Upravený'!C84=\"\",\"\",'2_Upravený'!C84)","v":"RIV: MUDr. Martin Loveček, PhD. - MEX"},{"$f":"'2_Upravený'!D84-'1_Původní'!D84","v":146750},{"$f":"'2_Upravený'!E84-'1_Původní'!E84","v":146750},{"$f":"'2_Upravený'!F84-'1_Původní'!F84","v":146750},{"$f":"'2_Upravený'!G84-'1_Původní'!G84","v":146750},{"$f":"'2_Upravený'!H84-'1_Původní'!H84","v":146750},{"$f":"'2_Upravený'!I84-'1_Původní'!I84","v":146750},{"$f":"'2_Upravený'!J84-'1_Původní'!J84","v":146018.73970000001},{"$f":"'2_Upravený'!K84-'1_Původní'!K84","v":146750},{"$f":"'2_Upravený'!L84-'1_Původní'!L84","v":146750},{"$f":"'2_Upravený'!M84-'1_Původní'!M84","v":141792.3033},{"$f":"'2_Upravený'!N84-'1_Původní'!N84","v":146750},{"$f":"'2_Upravený'!O84-'1_Původní'!O84","v":146750},1755311.0430000001]
[null,{"$f":"IF('2_Upravený'!B85=\"\",\"\",'2_Upravený'!B85)","v":"9001"},{"$f":"IF('2_Upravený'!C85=\"\",\"\",'2_Upravený'!C85)","v":"Úsek ředitele"},{"$f":"'2_Upravený'!D85-'1_Původní'!D85","v":-4409.3753999999999},{"$f":"'2_Upravený'!E85-'1_Původní'!E85","v":-899.82190000000003},{"$f":"'2_Upravený'!F85-'1_Původní'!F85","v":0},{"$f":"'2_Upravený'!G85-'1_Původní'!G85","v":0},{"$f":"'2_Upravený'!H85-'1_Původní'!H85","v":0},{"$f":"'2_Upravený'!I85-'1_Původní'!I85","v":-5418.8517000000002},{"$f":"'2_Upravený'!J85-'1_Původní'!J85","v":0},{"$f":"'2_Upravený'!K85-'1_Původní'!K85","v":0},{"$f":"'2_Upravený'!L85-'1_Původní'!L85","v":-1367.7293999999999},{"$f":"'2_Upravený'!M85-'1_Původní'!M85","v":0},{"$f":"'2_Upravený'!N85-'1_Původní'!N85","v":-19830.786700000001},{"$f":"'2_Upravený'!O85-'1_Původní'!O85","v":-19743.828699999998},-51670.393799999998]
[null,{"$f":"IF('2_Upravený'!B86=\"\",\"\",'2_Upravený'!B86)","v":"9010"},{"$f":"IF('2_Upravený'!C86=\"\",\"\",'2_Upravený'!C86)","v":"Organizace plesu FN"},{"$f":"'2_Upravený'!D86-'1_Původní'!D86","v":0},{"$f":"'2_Upravený'!E86-'1_Původní'!E86","v":0},{"$f":"'2_Upravený'!F86-'1_Původní'!F86","v":-338.95769999999999},{"$f":"'2_Upravený'!G86-'1_Původní'!G86","v":0},{"$f":"'2_Upravený'!H86-'1_Původní'!H86","v":0},{"$f":"'2_Upravený'!I86-'1_Původní'!I86","v":0},{"$f":"'2_Upravený'!J86-'1_Původní'!J86","v":0},{"$f":"'2_Upravený'!K86-'1_Původní'!K86","v":0},{"$f":"'2_Upravený'!L86-'1_Původní'!L86","v":0},{"$f":"'2_Upravený'!M86-'1_Původní'!M86","v":0},{"$f":"'2_Upravený'!N86-'1_Původní'!N86","v":0},{"$f":"'2_Upravený'!O86-'1_Původní'!O86","v":0},-338.95769999999999]
[null,{"$f":"IF('2_Upravený'!B87=\"\",\"\",'2_Upravený'!B87)","v":"9028"},{"$f":"IF('2_Upravený'!C87=\"\",\"\",'2_Upravený'!C87)","v":"Oddělení vědy a výzkumu"},{"$f":"'2_Upravený'!D87-'1_Původní'!D87","v":0},{"$f":"'2_Upravený'!E87-'1_Původní'!E87","v":0},{"$f":"'2_Upravený'!F87-'1_Původní'!F87","v":0},{"$f":"'2_Upravený'!G87-'1_Původní'!G87","v":-40542.68},{"$f":"'2_Upravený'!H87-'1_Původní'!H87","v":0},{"$f":"'2_Upravený'!I87-'1_Původní'!I87","v":0},{"$f":"'2_Upravený'!J87-'1_Původní'!J87","v":-4957.6967000000004},{"$f":"'2_Upravený'!K87-'1_Původní'!K87","v":0},{"$f":"'2_Upravený'!L87-'1_Původní'!L87","v":-1153.1602},{"$f":"'2_Upravený'!M87-'1_Původní'!M87","v":0},{"$f":"'2_Upravený'!N87-'1_Původní'!N87","v":46041.657899999998},{"$f":"'2_Upravený'!O87-'1_Původní'!O87","v":0},-611.87900000000081]
[null,{"$f":"IF('2_Upravený'!B88=\"\",\"\",'2_Upravený'!B88)","v":"9041"},{"$f":"IF('2_Upravený'!C88=\"\",\"\",'2_Upravený'!C88)","v":"Útvar ekonomiky a zdravotních pojišťoven"},{"$f":"'2_Upravený'!D88-'1_Původní'!D88","v":-9798.0445999999993},{"$f":"'2_Upravený'!E88-'1_Původní'!E88","v":0},{"$f":"'2_Upravený'!F88-'1_Původní'!F88","v":-127.4128},{"$f":"'2_Upravený'!G88-'1_Původní'!G88","v":0},{"$f":"'2_Upravený'!H88-'1_Původní'!H88","v":0},{"$f":"'2_Upravený'!I88-'1_Původní'!I88","v":0},{"$f":"'2_Upravený'!J88-'1_Původní'!J88","v":0},{"$f":"'2_Upravený'!K88-'1_Původní'!K88","v":0},{"$f":"'2_Upravený'!L88-'1_Původní'!L88","v":0},{"$f":"'2_Upravený'!M88-'1_Původní'!M88","v":0},{"$f":"'2_Upravený'!N88-'1_Původní'!N88","v":0},{"$f":"'2_Upravený'!O88-'1_Původní'!O88","v":0},-9925.4573999999993]
[null,{"$f":"IF('2_Upravený'!B89=\"\",\"\",'2_Upravený'!B89)","v":"9051"},{"$f":"IF('2_Upravený'!C89=\"\",\"\",'2_Upravený'!C89)","v":"Útvar hospodářsko technické správy"},{"$f":"'2_Upravený'!D89-'1_Původní'!D89","v":516730.1216662873},{"$f":"'2_Upravený'!E89-'1_Původní'!E89","v":524166.66666628729},{"$f":"'2_Upravený'!F89-'1_Původní'!F89","v":524166.66666628729},{"$f":"'2_Upravený'!G89-'1_Původní'!G89","v":522431.47286628728},{"$f":"'2_Upravený'!H89-'1_Původní'!H89","v":524166.66666628729},{"$f":"'2_Upravený'!I89-'1_Původní'!I89","v":524166.66666628729},{"$f":"'2_Upravený'!J89-'1_Původní'!J89","v":524166.66666628729},{"$f":"'2_Upravený'!K89-'1_Původní'!K89","v":524122.04736628727},{"$f":"'2_Upravený'!L89-'1_Původní'!L89","v":522927.24246628728},{"$f":"'2_Upravený'!M89-'1_Původní'!M89","v":524166.66666628729},{"$f":"'2_Upravený'!N89-'1_Původní'!N89","v":524166.66666628729},{"$f":"'2_Upravený'!O89-'1_Původní'!O89","v":524166.66666628729},6279544.2176954467]
[null,{"$f":"IF('2_Upravený'!B90=\"\",\"\",'2_Upravený'!B90)","v":"9081"},{"$f":"IF('2_Upravený'!C90=\"\",\"\",'2_Upravený'!C90)","v":"Úsek informačních technologií"},{"$f":"'2_Upravený'!D90-'1_Původní'!D90","v":0},{"$f":"'2_Upravený'!E90-'1_Původní'!E90","v":0},{"$f":"'2_Upravený'!F90-'1_Původní'!F90","v":0},{"$f":"'2_Upravený'!G90-'1_Původní'!G90","v":0},{"$f":"'2_Upravený'!H90-'1_Původní'!H90","v":0},{"$f":"'2_Upravený'!I90-'1_Původní'!I90","v":-1008.8913},{"$f":"'2_Upravený'!J90-'1_Původní'!J90","v":0},{"$f":"'2_Upravený'!K90-'1_Původní'!K90","v":0},{"$f":"'2_Upravený'!L90-'1_Původní'!L90","v":0},{"$f":"'2_Upravený'!M90-'1_Původní'!M90","v":0},{"$f":"'2_Upravený'!N90-'1_Původní'!N90","v":0},{"$f":"'2_Upravený'!O90-'1_Původní'!O90","v":0},-1008.8913]
[null,{"$f":"IF('2_Upravený'!B91=\"\",\"\",'2_Upravený'!B91)","v":"9084"},{"$f":"IF('2_Upravený'!C91=\"\",\"\",'2_Upravený'!C91)","v":"Oddělení centrální spisovny"},{"$f":"'2_Upravený'!D91-'1_Původní'!D91","v":0},{"$f":"'2_Upravený'!E91-'1_Původní'!E91","v":0},{"$f":"'2_Upravený'!F91-'1_Původní'!F91","v":0},{"$f":"'2_Upravený'!G91-'1_Původní'!G91","v":0},{"$f":"'2_Upravený'!H91-'1_Původní'!H91","v":0},{"$f":"'2_Upravený'!I91-'1_Původní'!I91","v":0},{"$f":"'2_Upravený'!J91-'1_Původní'!J91","v":0},{"$f":"'2_Upravený'!K91-'1_Původní'!K91","v":0},{"$f":"'2_Upravený'!L91-'1_Původní'!L91","v":0},{"$f":"'2_Upravený'!M91-'1_Původní'!M91","v":0},{"$f":"'2_Upravený'!N91-'1_Původní'!N91","v":-2099.5844999999999},{"$f":"'2_Upravený'!O91-'1_Původní'!O91","v":0},-2099.5844999999999]
[null,{"$f":"IF('2_Upravený'!B92=\"\",\"\",'2_Upravený'!B92)","v":"9091"},{"$f":"IF('2_Upravený'!C92=\"\",\"\",'2_Upravený'!C92)","v":"Obchodní úsek"},{"$f":"'2_Upravený'!D92-'1_Původní'!D92","v":0},{"$f":"'2_Upravený'!E92-'1_Původní'!E92","v":0},{"$f":"'2_Upravený'!F92-'1_Původní'!F92","v":0},{"$f":"'2_Upravený'!G92-'1_Původní'!G92","v":0},{"$f":"'2_Upravený'!H92-'1_Původní'!H92","v":0},{"$f":"'2_Upravený'!I92-'1_Původní'!I92","v":0},{"$f":"'2_Upravený'!J92-'1_Původní'!J92","v":0},{"$f":"'2_Upravený'!K92-'1_Původní'!K92","v":0},{"$f":"'2_Upravený'!L92-'1_Původní'!L92","v":0},{"$f":"'2_Upravený'!M92-'1_Původní'!M92","v":0},{"$f":"'2_Upravený'!N92-'1_Původní'!N92","v":-3422.8928999999998},{"$f":"'2_Upravený'!O92-'1_Původní'!O92","v":0},-3422.8928999999998]
[null,{"$f":"IF('2_Upravený'!B93=\"\",\"\",'2_Upravený'!B93)","v":"9096"},{"$f":"IF('2_Upravený'!C93=\"\",\"\",'2_Upravený'!C93)","v":"Odbor marketingu"},{"$f":"'2_Upravený'!D93-'1_Původní'!D93","v":-849.25340000000006},{"$f":"'2_Upravený'!E93-'1_Původní'!E93","v":0},{"$f":"'2_Upravený'!F93-'1_Původní'!F93","v":0},{"$f":"'2_Upravený'!G93-'1_Původní'!G93","v":0},{"$f":"'2_Upravený'!H93-'1_Původní'!H93","v":0},{"$f":"'2_Upravený'!I93-'1_Původní'!I93","v":0},{"$f":"'2_Upravený'!J93-'1_Původní'!J93","v":0},{"$f":"'2_Upravený'!K93-'1_Původní'!K93","v":0},{"$f":"'2_Upravený'!L93-'1_Původní'!L93","v":0},{"$f":"'2_Upravený'!M93-'1_Původní'!M93","v":0},{"$f":"'2_Upravený'!N93-'1_Původní'!N93","v":1.5567},{"$f":"'2_Upravený'!O93-'1_Původní'!O93","v":0},-847.69670000000008]
[null,{"$f":"IF('2_Upravený'!B94=\"\",\"\",'2_Upravený'!B94)","v":"9204"},{"$f":"IF('2_Upravený'!C94=\"\",\"\",'2_Upravený'!C94)","v":"Areál FNOL"},{"$f":"'2_Upravený'!D94-'1_Původní'!D94","v":0},{"$f":"'2_Upravený'!E94-'1_Původní'!E94","v":0},{"$f":"'2_Upravený'!F94-'1_Původní'!F94","v":0},{"$f":"'2_Upravený'!G94-'1_Původní'!G94","v":-19796.0828},{"$f":"'2_Upravený'!H94-'1_Původní'!H94","v":-806224.28540000005},{"$f":"'2_Upravený'!I94-'1_Původní'!I94","v":-1787597.182},{"$f":"'2_Upravený'!J94-'1_Původní'!J94","v":-1021351.5841},{"$f":"'2_Upravený'!K94-'1_Původní'!K94","v":-590563.78139999998},{"$f":"'2_Upravený'!L94-'1_Původní'!L94","v":-52561.5},{"$f":"'2_Upravený'!M94-'1_Původní'!M94","v":-64991.521399999998},{"$f":"'2_Upravený'!N94-'1_Původní'!N94","v":0},{"$f":"'2_Upravený'!O94-'1_Původní'!O94","v":-49642.408199999998},-4392728.3453000002]
[null,{"$f":"IF('2_Upravený'!B95=\"\",\"\",'2_Upravený'!B95)","v":"9209"},{"$f":"IF('2_Upravený'!C95=\"\",\"\",'2_Upravený'!C95)","v":"Areál - ulice Profesora Fuky"},{"$f":"'2_Upravený'!D95-'1_Původní'!D95","v":0},{"$f":"'2_Upravený'!E95-'1_Původní'!E95","v":-1953895.0009000001},{"$f":"'2_Upravený'!F95-'1_Původní'!F95","v":-4434.268},{"$f":"'2_Upravený'!G95-'1_Původní'!G95","v":-2983991.8775999998},{"$f":"'2_Upravený'!H95-'1_Původní'!H95","v":-929397.87730000005},{"$f":"'2_Upravený'!I95-'1_Původní'!I95","v":0},{"$f":"'2_Upravený'!J95-'1_Původní'!J95","v":12717.4835},{"$f":"'2_Upravený'!K95-'1_Původní'!K95","v":0},{"$f":"'2_Upravený'!L95-'1_Původní'!L95","v":0},{"$f":"'2_Upravený'!M95-'1_Původní'!M95","v":0},{"$f":"'2_Upravený'!N95-'1_Původní'!N95","v":0},{"$f":"'2_Upravený'!O95-'1_Původní'!O95","v":0},-5859001.5402999995]
[null,{"$f":"IF('2_Upravený'!B96=\"\",\"\",'2_Upravený'!B96)","v":"9405"},{"$f":"IF('2_Upravený'!C96=\"\",\"\",'2_Upravený'!C96)","v":"Provoz dopravy - sanitní - převoz zdrav. pojišťovny"},{"$f":"'2_Upravený'!D96-'1_Původní'!D96","v":-2026.2106000000001},{"$f":"'2_Upravený'!E96-'1_Původní'!E96","v":0},{"$f":"'2_Upravený'!F96-'1_Původní'!F96","v":0},{"$f":"'2_Upravený'!G96-'1_Původní'!G96","v":0},{"$f":"'2_Upravený'!H96-'1_Původní'!H96","v":0},{"$f":"'2_Upravený'!I96-'1_Původní'!I96","v":0},{"$f":"'2_Upravený'!J96-'1_Původní'!J96","v":0},{"$f":"'2_Upravený'!K96-'1_Původní'!K96","v":0},{"$f":"'2_Upravený'!L96-'1_Původní'!L96","v":0},{"$f":"'2_Upravený'!M96-'1_Původní'!M96","v":0},{"$f":"'2_Upravený'!N96-'1_Původní'!N96","v":0},{"$f":"'2_Upravený'!O96-'1_Původní'!O96","v":0},-2026.2106000000001]
[null,{"$f":"IF('2_Upravený'!B97=\"\",\"\",'2_Upravený'!B97)","v":"9819"},{"$f":"IF('2_Upravený'!C97=\"\",\"\",'2_Upravený'!C97)","v":"TranMZČR: Bezpečnost a kvalita zdravotní péče"},{"$f":"'2_Upravený'!D97-'1_Původní'!D97","v":0},{"$f":"'2_Upravený'!E97-'1_Původní'!E97","v":0},{"$f":"'2_Upravený'!F97-'1_Původní'!F97","v":0},{"$f":"'2_Upravený'!G97-'1_Původní'!G97","v":0},{"$f":"'2_Upravený'!H97-'1_Původní'!H97","v":0},{"$f":"'2_Upravený'!I97-'1_Původní'!I97","v":0},{"$f":"'2_Upravený'!J97-'1_Původní'!J97","v":0},{"$f":"'2_Upravený'!K97-'1_Původní'!K97","v":0},{"$f":"'2_Upravený'!L97-'1_Původní'!L97","v":0},{"$f":"'2_Upravený'!M97-'1_Původní'!M97","v":-8656.1383999999998},{"$f":"'2_Upravený'!N97-'1_Původní'!N97","v":0},{"$f":"'2_Upravený'!O97-'1_Původní'!O97","v":0},-8656.1383999999998]
[null,{"$f":"IF('2_Upravený'!B98=\"\",\"\",'2_Upravený'!B98)","v":"8599"},{"$f":"IF('2_Upravený'!C98=\"\",\"\",'2_Upravený'!C98)","v":"Granty - pomocné středisko"},{"$f":"'2_Upravený'!D98-'1_Původní'!D98","v":50000},{"$f":"'2_Upravený'!E98-'1_Původní'!E98","v":50000},{"$f":"'2_Upravený'!F98-'1_Původní'!F98","v":50000},{"$f":"'2_Upravený'!G98-'1_Původní'!G98","v":50000},{"$f":"'2_Upravený'!H98-'1_Původní'!H98","v":50000},{"$f":"'2_Upravený'!I98-'1_Původní'!I98","v":50000},{"$f":"'2_Upravený'!J98-'1_Původní'!J98","v":50000},{"$f":"'2_Upravený'!K98-'1_Původní'!K98","v":50000},{"$f":"'2_Upravený'!L98-'1_Původní'!L98","v":50000},{"$f":"'2_Upravený'!M98-'1_Původní'!M98","v":50000},{"$f":"'2_Upravený'!N98-'1_Původní'!N98","v":50000},{"$f":"'2_Upravený'!O98-'1_Původní'!O98","v":50000},600000]
[null,{"$f":"IF('2_Upravený'!B99=\"\",\"\",'2_Upravený'!B99)","v":"8988"},{"$f":"IF('2_Upravený'!C99=\"\",\"\",'2_Upravený'!C99)","v":"Pomocné středisko"},{"$f":"'2_Upravený'!D99-'1_Původní'!D99","v":150000},{"$f":"'2_Upravený'!E99-'1_Původní'!E99","v":150000},{"$f":"'2_Upravený'!F99-'1_Původní'!F99","v":150000},{"$f":"'2_Upravený'!G99-'1_Původní'!G99","v":150000},{"$f":"'2_Upravený'!H99-'1_Původní'!H99","v":150000},{"$f":"'2_Upravený'!I99-'1_Původní'!I99","v":150000},{"$f":"'2_Upravený'!J99-'1_Původní'!J99","v":150000},{"$f":"'2_Upravený'!K99-'1_Původní'!K99","v":150000},{"$f":"'2_Upravený'!L99-'1_Původní'!L99","v":150000},{"$f":"'2_Upravený'!M99-'1_Původní'!M99","v":150000},{"$f":"'2_Upravený'!N99-'1_Původní'!N99","v":150000},{"$f":"'2_Upravený'!O99-'1_Původní'!O99","v":150000},1800000]
[null,{"$f":"IF('2_Upravený'!B100=\"\",\"\",'2_Upravený'!B100)","v":""},{"$f":"IF('2_Upravený'!C100=\"\",\"\",'2_Upravený'!C100)","v":""},{"$f":"'2_Upravený'!D100-'1_Původní'!D100","v":0},{"$f":"'2_Upravený'!E100-'1_Původní'!E100","v":0},{"$f":"'2_Upravený'!F100-'1_Původní'!F100","v":0},{"$f":"'2_Upravený'!G100-'1_Původní'!G100","v":0},{"$f":"'2_Upravený'!H100-'1_Původní'!H100","v":0},{"$f":"'2_Upravený'!I100-'1_Původní'!I100","v":0},{"$f":"'2_Upravený'!J100-'1_Původní'!J100","v":0},{"$f":"'2_Upravený'!K100-'1_Původní'!K100","v":0},{"$f":"'2_Upravený'!L100-'1_Původní'!L100","v":0},{"$f":"'2_Upravený'!M100-'1_Původní'!M100","v":0},{"$f":"'2_Upravený'!N100-'1_Původní'!N100","v":0},{"$f":"'2_Upravený'!O100-'1_Původní'!O100","v":0},0]

{"sheet":"CisNS","index":5,"n_rows":1042,"n_cols":2,"rows_kept":1042,"cut":false,"hidden":true,"merged":[]}
["pracv","pracvt"]
["0101","Vedení klinického pracoviště"]
["0102",""]
["0103",""]
["0104","OP - Interaktivní kardiologie-moderní výukové metody"]
["0107","IOP- Mod.obn.přistr.vyb.komplex.kardiovas.centra"]
["0111","Lůžkové oddělení 1 "]
["0112","Lůžkové oddělení"]
["0113","Lůžkové oddělení 4 "]
["0115","Lůžkové oddělení ECMO"]
["0116","Lůžkové oddělení COVID 19"]
["0117","1IK: lůžkové oddělení"]
["0121","Ambulance"]
["0122","Ambulance - PAH "]
["0123","Ambulance"]
["0124","Ambulance"]
["0131","JIP "]
["0171","Odd. invaz. vyš. metod-kardiovertery"]
["0172","Katetrizační sál"]
["0176","IROP - Návazná péče"]
["0182","Rezidenti 2015 - nelékařské obory"]
["0183","Rezidenti 2016 - ošetřovatelská a intenzivní péče"]
["0184","1IK: rezidenti 2019 - nelékařské obory"]
["0185","Rezidenti 2018 - nelékařské obory"]
["0187","1IK: rezidenti 2013 - ošetřovatelská péče"]
["0188","Rezidenti 2017 - nelékařské obory"]
["0189","Rezidenti 2014 - nelékařské obory"]
["0194","Centrum - I.interna "]
["0201","Vedení klinického pracoviště gastroenterologiie"]
["0204","IOP - Mod.obn.přístr.vyb.centra komplexní onkologické péče "]
["0205","IOP - Mod.obn.přístr.vyb.traumatologického c."]
["0206","IOP - Mod.tech.vyb.v oblasti prevence nozokomiál.infek."]
["0213","Lůžkové oddělení 30C"]
["0216","Metabolická jednotka 30M"]
["0221","Ambulance"]
["0226",""]
["0231","JIP 30D"]
["0266","Pracoviště DK COS"]
["0271","Endoskopie"]
["0272","Dospávací hala "]
["0276","IROP - Návazná péče"]
["0284","2IK-GER: rezidenti 2019 - nelékařské obory"]
["0286","Rezidenti 2018 - lékaři"]
["0294","Centrum - II.interna"]
["0301","Vedení klinického pracoviště"]
["0306","IOP - Mod.tech.vyb.v oblasti prevence nozokomiál.infek."]
["0311","Lůžkové oddělení 39A + 39R"]
["0312","Lůžkové oddělení 39B + 39C"]
["0313","3IK: COVID - ORT"]
["0321","Ambulance"]
["0322","Ambulance - podiatrie"]
["0331","JIP 39D"]
["0352","Hemodialyzační středisko"]
["0353","CAPD"]
["0376","IROP - Návazná péče"]
["0384","Rezidenti 2010 projekt č. 1 (lékaři)"]
["0386","3IK: Rezidenti 2019 - lékaři"]
["0387","3IK: Rezidenti 2020 - lékaři"]
["0394","Centrum - III. interna"]
["0401","Vedení klinického pracoviště"]
["0404","IOP - Mod.obn.přístr.vyb.centra komplexní onkologické péče "]
["0406","IOP - Mod.tech.vyb.v oblasti prevence nozokomiál.infek."]
["0411","Lůžkové oddělení 8"]
["0412","Lůžkové oddělení 9 + 9P"]
["0413","Lůžkové oddělení 3"]
["0414","Lůžkové oddělení 4"]
["0421","Ambulance"]
["0422","Ambulance"]
["0432","JIP  6"]
["0464","Pracoviště COS"]
["0466","Pracoviště DK COS"]
["0471","Odd. invaz. vyš. metotody-endoskopie"]
["0476","IROP - Návazná péče"]
["0483","Rezidenti 2016 - ošetřovatelská a intenzivní péče"]
["0484","1CHIR: rezidenti 2019 - nelékařské obory"]
["0487","1CHIR: rezidenti 2013 - ošetřovatelská péče"]
["0489","Rezidenti 2014 - nelékařské obory"]
["0499","Rezidenti"]
["0501","Vedení klinického pracoviště"]
["0507","IOP- Mod.obn.přistr.vyb.komplex.kardiovas.centra"]
["0511","Lůžkové oddělení 37"]
["0521","Ambulance"]
["0532","JIP 37A "]
["0564","Pracoviště COS"]
["0566","Pracoviště DK COS"]
["0601","Vedení klinického pracoviště"]
["0604","IOP - Mod.obn.přístr.vyb.centra komplexní onkologické péče "]
["0605","IOP - Mod.obn.přístr.vyb.traumatologického c."]
["0606","IOP - Mod.tech.vyb.v oblasti prevence nozokomiál.infek."]
["0609","IOP - Mod.obn.přístr.vyb.cerebrovaskulárního centra FNOL"]
["0611","Lůžkové oddělení 34"]
["0612","Lůžkové oddělení 36A"]
["0621","Ambulance"]
["0631","JIP "]
["0662","Operační sál - lokální"]
["0666","Pracoviště DK COS"]
["0676","IROP - Návazná péče"]
["0682","Rezidenti 2015 - nelékařské obory"]
["0683","Rezidenti 2016 - ošetřovatelská a intenzivní péče"]
["0684","NCHIR: rezidenti 2019 - nelékařské obory"]
["0685","Rezidenti 2018"]
["0687","NCHIR: rezidenti 2013 - ošetřovatelská péče"]
["0688","Rezidenti 2017 - nelékařské obory"]
["0689","Rezidenti 2014 - nelékařské obory"]
["0701","Vedení klinického pracoviště"]
["0705","IOP - Mod.obn.přístr.vyb.traumatologického c."]
["0706","IOP - Mod.tech.vyb.v oblasti prevence nozokomiál.infek."]
["0709","IOP - Mod.obn.přístr.vyb.cerebrovaskulárního centra FNOL"]
["0715","Lůžkové oddělení ECMO"]
["0721","Ambulance"]
["0731","JIP"]
["0732","NIOP"]
["0733","DIOP"]
["0762","Operační sál - lok. prac. anesteziologů"]
["0764","Pracoviště COS"]
["0765","Dospávací hala KAR"]
["0766","Pracoviště DK COS"]
["0775","IOP - Mod.obn.přístr.vyb.traumatologického cen. II"]
["0776","IROP - Návazná péče"]
["0782","Rezidenti 2015 - nelékařské obory"]
["0783","Rezidenti 2016 - ošetřovatelská a intenzivní péče"]
["0785","Rezidenti 2018"]
["0787","KARIM: rezidenti 2013 - ošetřovatelská péče"]
["0788","Rezidenti 2017 - nelékařské obory"]
["0789","Rezidenti 2014 - nelékařské obory"]
["0794","Centrum - KAR"]
["0801","Vedení klinického pracoviště"]
["0802","ZT pro Perinatologické centrum - IISSP"]
["0806","IOP - Mod.tech.vyb.v oblasti prevence nozokomiál.infek."]
["0811","Lůžkové oddělení 19B (šestinedělí)"]
["0817","Lůžkové oddělení 17 (operativní gyn.)"]
["0818","Intermediální jednotka (17A)"]
["0821","Ambulance"]
["0822","Ambulance - fetální medicína"]
["0823","Centrum asistované reprodukce"]
["0831","JIP"]
["0832","JIP 19 (porodní sál)"]
["0841","Laboratoř cytologická"]
["0862","Porodní sál - lokální"]
["0863","Operační sál OP 17 (z 08 62)"]
["0864","Pracoviště COS"]
["0873","IROP - Mod.obn.přístr.vyb.perinatologického centra"]
["0874","IROP - Mod.obn.přístr.vyb.onkogynekologického centra"]
["0884","PORGYN: rezidenti 2019 - nelékařské obory"]
["0885","Rezidenti 2018"]
["0886","Rezidenti 2018"]
["0901","Vedení klinického pracoviště"]
["0902","ZT pro Perinatologické centrum - IISSP"]
["0903","Norský fond - projekt 2009"]
["0904","Norský fond - projekt 2015"]
["0911","Lůžkové oddělení 16C + 16B +16BD"]
["0912",""]
["0921","Ambulance"]
["0931","JIP 16A +16D"]
["0932","JIP"]
["0973","IROP - Mod.obn.přístr.vyb.perinatologického centra"]
["0982","Rezidenti 2015 - nelékařské obory"]
["0984","NOVO: Rezidenti 2019 - nelékařské obory"]
["0988","Rezidenti 2017 - nelékařské obory"]
["0994","Centrum - novorozenecké"]
["1001","Vedení klinického pracoviště"]
["1004","IOP - Mod.obn.přístr.vyb.c.k.onkologické p.  "]
["1006","IOP - Mod.tech.vyb.v oblasti prevence nozokomiál.infek."]
["1008","IOP - Mod.a obnova přístroj.vyb.komplex.rehab.péče"]
["1011","Lůžkové oddělení 28B"]
["1012","Lůžkové oddělení 28C vč.dospávací haly"]
["1013","Lůžkové oddělení 21A"]
["1014","Lůžkové oddělení 21B"]
["1015","Lůžkové oddělení 28D"]
["1021","Ambulance"]
["1022","LPS dětská"]
["1023","Praktický lékař pro děti a dorost"]
["1026",""]
["1031","JIP 21B"]
["1032","JIP"]
["1033","JIP 21C (pro větší děti)"]
["1041","LEM"]
["1042","LEM"]
["1066","Pracoviště DK COS"]
["1071","Endoskopie"]
["1076","IROP - Návazná péče"]
["1083","Rezidenti 2016 - ošetřovatelská a intenzivní péče"]
["1084","DK: rezidenti 2010 projekt č. 1 (lékaři)"]
["1086","DK: Rezidenti 2019 - lékaři"]
["1087","DK: rezidenti 2020 - lékaři"]
["1089","Rezidenti 2014 - nelékařské obory"]
["1094","Centrum - DK"]
["1096","OPVaVI - NPU I (projekt ÚMTM)"]
["1097","OPVaVI - projekt ÚMTM (pouze os.nákl.)"]
["1101","Vedení klinického pracoviště"]
["1102","ZT pro ORT - IISSP"]
["1105","IOP - Mod.obn.přístr.vyb.traumatologického c."]
["1106","IOP - Mod.tech.vyb.v oblasti prevence nozokomiál.infek."]
["1108","IOP - Mod.a obnova přístroj.vyb.komplex.rehab.péče"]
["1111","Lůžkové oddělení 29A"]
["1112","Lůžkové oddělení 29B"]
["1113","Lůžkové oddělení 29C (6 lůžek KÚČOCH)"]
["1121","Ambulance"]
["1131","JIP 29A"]
["1151","Diagnostika poruch pohyb. funkcí - výzkum"]
["1162","Operační sál - lokální"]
["1166","Pracoviště DK COS"]
["1176","IROP - Návazná péče"]
["1183","Rezidenti 2016 - ošetřovatelská a intenzivní péče"]
["1184","ORT: rezidenti 2019 - nelékařské obory"]
["1185","Rezidenti 2018"]
["1188","Rezidenti 2017 - nelékařské obory"]
["1189","Rezidenti 2014 - nelékařské obory"]
["1201","Vedení klinického pracoviště"]
["1202","ISPROFIN -obměna pořístroje Lithotryptor"]
["1211","Lůžkové oddělení "]
["1221","Ambulance "]
["1262","Operační sál - lokální"]
["1264","Pracoviště COS"]
["1266","Pracoviště DK COS"]
["1276","UROL: IROP - Návazná péče"]
["1301","Vedení klinického pracoviště"]
["1306","IOP - Mod.tech.vyb.v oblasti prevence nozokomiál.infek."]
["1311","Lůžkové oddělení 14"]
["1321","Ambulance"]
["1331","JIP"]
["1362","Operační sál - lokální"]
["1364","Pracoviště COS"]
["1366","Pracoviště DK COS"]
["1384","ORL: rezidenti 2019 - nelékařské obory"]
["1385","ORL: rezidenti 2018 - nelékařské obory"]
["1388","Rezidenti 2017 - nelékařské obory"]
["1389","Rezidenti 2014 - nelékařské obory"]
["1401","Vedení klinického pracoviště"]
["1404","Norský fond - projekt 2015"]
["1406","IOP - Mod.tech.vyb.v oblasti prevence nozokomiál.infek."]
["1411","Lůžka"]
["1412","Lůžka 13"]
["1421","Ambulance"]
["1462","Operační sál - lokální"]
["1466","Pracoviště DK COS"]
["1484","OCNI: rezidenti 2019 - nelékařské obory"]
["1494","Centrum - oční"]
["1501","Vedení klinického pracoviště"]
["1521","Ambulance"]
["1584","Rezidenti 2010 projekt č. 1 (lékaři)"]
["1594","Centrum - alergologie"]
["1601","Vedení klinického pracoviště"]
["1604","IOP - Mod.obn.přístr.vyb.centra komplexní onkologické péče "]
["1605","IOP - Mod.obn.přístr.vyb.traumatologického c."]
["1606","IOP - Mod.tech.vyb.v oblasti prevence nozokomiál.infek."]
["1611","Lůžkové oddělení 26"]
["1612","Lůžkové oddělení 25"]
["1613","Lůžkové oddělení 24"]
["1621","Ambulance"]
["1622","Ambulance - transplantace"]
["1631","JIP 24A"]
["1641","Bronchologie"]
["1666","Pracoviště DK COS"]
["1676","IROP - Návazná péče"]
["1684","PLIC: rezidenti 2010 projekt č. 1 (lékaři)"]
["1685","Rezidenti 2018"]
["1686","PLIC: rezidenti 2019 - lékaři"]
["1687","PLIC: rezidenti 2020 - lékaři"]
["1694","Centrum - TRN"]
["1697","OPVaVI - projekt ÚMTM (pouze os.nákl.)"]
["1701","Vedení klinického pracoviště"]
["1702","ReMuS - nadace Impuls"]
["1703","Vzdělávací síť iktových center"]
["1704","OP VVV - Molekulární, buněčný a klinický přístup ke zdravému stárnutí"]
["1706","IOP - Mod.tech.vyb.v oblasti prevence nozokomiál.infek."]
["1709","IOP - Mod.obn.přístr.vyb.cerebrovaskulárního centra FNOL"]
["1711","Lůžkové oddělení 31A  "]
["1712","Lůžkové oddělení 31B"]
["1713","Lůžkové oddělení 35"]
["1721","Ambulance"]
["1731","JIP A  (5 lůžek resuscitační péče)"]
["1732","JIP B"]
["1752",""]
["1753",""]
["1791","Stacionář"]
["1794","Centrum - neurologie"]
["1801","Vedení klinického pracoviště"]
["1806","IOP - Mod.tech.vyb.v oblasti prevence nozokomiál.infek."]
["1811","Lůžkové oddělení 32A"]
["1812","Lůžkové oddělení 32C + krizové centrum"]
["1813","Lůžkové oddělení 32B"]
["1814","Ergoterapie a fyzioterapie"]
["1821","Ambulance"]
["1822","Ambulantní klinická psychologie"]
["1823","Ambulance AT centrum"]
["1824",""]
["1886","Rezidenti 2018"]
["1887","PSY: rezidenti 2020 - lékaři"]
["1891","Stacionář"]
["1901","Vedení klinického pracoviště"]
["1911","Lůžkové oddělení 43"]
["1921","Ambulance"]
["1922","Ambulance - péče o zaměstnance FNO"]
["1923","Ambulance - Centrum očkování"]
["1924","PRAC: ambulance - COVID-19 vakcinační centrum"]
["1925","PRAC: ambulance - COVID-19 mobilní očkovací teamy"]
["2001","Vedení klinického pracoviště"]
["2011","Lůžkové oddělení 10"]
["2021","Ambulance + operační sál lokální"]
["2022","Ambulance -  samoplátci"]
["2062",""]
["2094","Centrum - kožní "]
["2101","Vedení klinického pracoviště"]
["2102","OP - Informační síť onkologických center"]
["2103","Národní onkologický registr - NOR"]
["2104","IOP - Mod.obn.přístr.vyb.centra komplexní onkologické péče "]
["2106","IOP - Mod.tech.vyb.v oblasti prevence nozokomiál.infek."]
["2108","IOP - Mod.obn.přístr.vyb.c.k.onkologické p. II"]
["2111","Lůžkové oddělení 42A"]
["2112","Lůžkové oddělení 42B"]
["2113","Lůžkové oddělení"]
["2121","Ambulance + mamol. poradna"]
["2129","Ambulance"]
["2151","Ozařovny-přístrojové pracoviště"]
["2152","Radiační onkologie - brachyterapie"]
["2176","IROP - Návazná péče"]
["2194","Centrum  - onkologie"]
["2197","OPVaVI - projekt ÚMTM (pouze os.nákl.)"]
["2201","Vedení klinického pracoviště"]
["2208","IOP - Mod.obn.přístr.vyb.c.k.onkologické p. II"]
["2211","Lůžkové oddělení 40"]
["2221","Ambulance"]
["2241","Laboratoř-SVLS"]
["2251","Přístr.pracoviště - PET "]
["2277","IOP - Mod.obn.přístr.vyb.c.k.onkologické p. III"]
["2282","KNM: Rezidenti 2009 projekt č. 1(lékaři)"]
["2294","Centrum - KNM"]
["2401","Vedení klinického pracoviště"]
["2406","IOP - Mod.tech.vyb.v oblasti prevence nozokomiál.infek."]
["2421","Ambulance "]
["2422","Ambulance "]
["2423","Ambulance "]
["2424","Ambulance "]
["2425","Ambulance "]
["2426","Ambulance "]
["2501","Vedení klinického pracoviště"]
["2505","IOP - Mod.obn.přístr.vyb.traumatologického c."]
["2506","IOP - Mod.tech.vyb.v oblasti prevence nozokomiál.infek."]
["2511","Lůžkové oddělení 33"]
["2521","Ambulance"]
["2522","LPS stomatologická"]
["2523","LPS stomatologická - denní"]
["2525",""]
["2526",""]
["2562","Operační sál "]
["2563","Operační sál "]
["2565","Operační sál "]
["2576","IROP - Návazná péče"]
["2601","Vedení klinického pracoviště"]
["2608","IOP Mod.a obnova přístroj.vyb.komplex.rehab.péče"]
["2609","IOP - Mod.obn.přístr.vyb.cerebrovaskulárního centra FNOL"]
["2611","Lůžkové oddělení 44 a 45 "]
["2621",""]
["2622","RHC ambulance + kineziologie,kinezioterapie"]
["2651",""]
["2652",""]
["2701","Vedení klinického pracoviště"]
["2708","IOP Mod.a obnova přístroj.vyb.komplex.rehab.péče"]
["2721","TVL ambulance"]
["2723","Ambulance - akupunktura"]
["2724","Ambulance - prevence"]
["2801","Vedení klinického pracoviště"]
["2821","Ambulance"]
["2841","Laboratoř"]
["2901","Vedení klinického pracoviště"]
["2911","Lůžkové oddělení"]
["2921","Ambulance"]
["2962","Operační sál lokální"]
["2964","Pracoviště COS"]
["2966","Pracoviště DK COS"]
["2994","Centrum -  PCHIR"]
["3001","Vedení klinického pracoviště geriatrie"]
["3011","Lůžkové oddělení 46 "]
["3012","Lůžkové oddělení 48 (LDN)"]
["3021","Ambulance"]
["3022","Ambulance"]
["3081",""]
["3101","Vedení klinického pracoviště"]
["3108","IOP Mod.a obnova přístroj.vyb.komplex.rehab.péče"]
["3111","Lůžkové oddělení 27"]
["3112","Lůžkové oddělení"]
["3121","Ambulance"]
["3131","JIP 27"]
["3164","Pracoviště COS"]
["3166","Pracoviště DK COS"]
["3176","IROP - Návazná péče"]
["3201","Vedení klinického pracoviště"]
["3203","HOK: OPŽP - Novostavba pavilonu HOK"]
["3204","IOP - Mod.obn.přístr.vyb.centra komplexní onkologické péče "]
["3208","IOP - Mod.obn.přístr.vyb.c.k.onkologické p. II"]
["3211","Lůžkové oddělení 5A"]
["3221","Ambulance"]
["3231","JIP 5B"]
["3232","JIP 5C"]
["3241","Laboratoř - SVLS"]
["3242","Tkáňová banka"]
["3243","Laboratoř krevních obrazů a cytomorfologie"]
["3244","Laboratoř koagulační"]
["3245","Laboratoř cytogenetiky a molekulární cytogenetiky"]
["3246","Laboratoř průtokové cytometrie"]
["3247","Laboratoř molekulární biologie"]
["3248","Laboratoř tkáňových kultur"]
["3249","Array CGH"]
["3276","IROP - Návazná péče"]
["3282","Rezidenti 2015 - nelékařské obory"]
["3283","Rezidenti 2016 - ošetřovatelská a intenzivní péče"]
["3284","HOK: rezidenti 2019 - nelékařské obory"]
["3285","Rezidenti 2018"]
["3287","HOK: rezidenti 2013 - ošetřovatelská péče"]
["3289","Rezidenti 2014 - nelékařské obory"]
["3294","Centrum -  HOK"]
["3301","Vedení klinického pracoviště"]
["3302","E-learningová podpora - Biolink"]
["3303","E-learningová podpora prakt. výuky biochem.a imunogen"]
["3321","Metabolická ambulance"]
["3322","Úsek centrálních odběrů"]
["3341","Centrální laboratoř"]
["3342","Laboratoř DMP"]
["3343","Centrální laboratorní příjem"]
["3344",""]
["3345","OKB: Laboratoř kardioimunogenetiky"]
["3386","OKB: rezidenti 2011 projekt č.2 (oš.péče)"]
["3396","OPVaVI - NPU I (projekt ÚMTM)"]
["3397","OPVaVI - projekt ÚMTM (pouze os.nákl.)"]
["3401","Vedení klinického pracoviště"]
["3405","IOP - Mod.obn.přístr.vyb.traumatologického c."]
["3407","IOP- Mod.obn.přistr.vyb.komplex.kardiovas.centra"]
["3408","IOP - Mod.obn.přístr.vyb.c.k.onkologické p. II"]
["3409","IOP - Mod.obn.přístr.vyb.cerebrovaskulárního centra FNOL"]
["3451","Přístr. pracoviště -SVLS + magnet. rezonance"]
["3452","Přístr. pracoviště -detašová pracoviště+screen.m."]
["3464","Pracoviště COS"]
["3471","Intervenční radiol. + katetrizační sál os.nákl."]
["3473","RTG: IROP - Mod.obn.vyb.přístr.perinatologi"]
["3475","IOP - Mod.obn.přístr.vyb.traumatologického cen. II"]
["3476","IROP - Návazná péče"]
["3477","IOP - Mod.obn.přístr.vyb.c.k.onkologické p. III"]
["3484","RTG: rezidenti 2019 - nelékařské obory"]
["3485","Rezidenti 2018"]
["3501","Vedení klinického pracoviště"]
["3503","TO - krizová připravenost"]
["3521","Ambulance - hematologická poradna"]
["3522","Odběrné místo Jesenícká nemocnice"]
["3541","Laboratoř - SVLS"]
["3544","Pochůzková služba"]
["3581",""]
["3587",""]
["3590","Výroba"]
["3621","Ambulance"]
["3704","IOP - Mod.obn.přístr.vyb.centra komplexní onkologické péče "]
["3741","Laboratoř"]
["3742","Laboratoř - referenční diagnostika"]
["3743","Laboratoř"]
["3788","PATOL: rezidenti 2012 projekt č. 1 (lékaři)"]
["3797","OPVaVI - projekt ÚMTM (pouze os.nákl.)"]
["3841","Soudní lékařství - laboratoř"]
["3921","Ambulance - odborná poradna"]
["4041","Mikrobiologie - laboratoř"]
["4081",""]
["4097","OPVaVI - projekt ÚMTM (pouze os.nákl.)"]
["4141","Imunologie - laboratoř"]
["4142",""]
["4143","Imunologie"]
["4181",""]
["4197","OPVaVI - projekt ÚMTM (pouze os.nákl.)"]
["4321","Ambulance - konzilia"]
["4397","OPVaVI - projekt ÚMTM (pouze os.nákl.)"]
["4398","Klinická farmakologie"]
["4441","LEM - laboratoř experimentální medicíny"]
["4442","LEM - referenční diagnostika"]
["4443","LEM - laboratoř kardiogenomiky "]
["4496","OPVaVI - NPU I (projekt ÚMTM)"]
["4581",""]
["4598","Sociální oddělení"]
["4602","RPZP - Umění komunikace-podpora dárcovství orgánů"]
["4692","Transplantační centrum + koordinační"]
["4704","IOP - Mod.obn.přístr.vyb.centra komplexní onkologické péče "]
["4705","IOP - Mod.obn.přístr.vyb.traumatologického c."]
["4764","Centrální operační sály "]
["4766","Operační sály dětské chirurgie"]
["4776","IROP - Návazná péče"]
["4782","Rezidenti 2015 - nelékařské obory"]
["4787","COSS: rezidenti 2013 - ošetřovatelská péče"]
["4789","Rezidenti 2014 - nelékařské obory"]
["4801","Lékárna - vedení klinického pracoviště"]
["4802","Lékárna - výdejna Z (hlavní lékárna)"]
["4803","OP - specializační vzdělávání klinických farmaceutů"]
["4804","Lékárna - výdejna A (monoblok)"]
["4805","Lékárna - PZT-FONI"]
["4806","Lékárna - výdej HVLP"]
["4807","Lékárna - klinický farmaceut"]
["4808","LEK: lékárna - výdejna ZP - Puškinova ul."]
["4809","LEK: výdejna léků - Puškinova ul."]
["4822","Lékárenská pohotovost"]
["4841","Lékárna - oddělení ředění cytostatik"]
["4842","Lékárna - oddělení přípravy sterilních léčiv"]
["4843","Lékárna - oddělení přípravy léčiv"]
["4844","Lékárna - oddělení diagnostik"]
["5001","Vedení klinického pracoviště"]
["5007","IOP- Mod.obn.přistr.vyb.komplex.kardiovas.centra"]
["5011","Lůžkové oddělení 50"]
["5015","Lůžkové oddělení ECMO"]
["5021","Ambulance"]
["5031","JIP 50B"]
["5032","JIP"]
["5062","Operační sál - lokální"]
["5071","PICC tým"]
["5076","IROP - Návazná péče"]
["5082","Rezidenti 2015 - nelékařské obory"]
["5083","Rezidenti 2016 - ošetřovatelská a intenzivní péče"]
["5085","Rezidenti 2018"]
["5087","KCHIR: rezidenti 2013 - ošetřovatelská péče"]
["5089","Rezidenti 2014 - nelékařské obory"]
["5102","NTMC - Národní telemedicínské centrum - provoz"]
["5103","NTMC - Transfer technologií"]
["5104","NTMC - SCIROCCO"]
["5105","NTMC - TWINNING"]
["5106","NTMC: SHAPES"]
["5107","NTMC: PROFID"]
["5108","NTMC: Projekt niCE-life"]
["5110","NTMC: Projekt X"]
["5398","Odd. lékařské fyziky a rad. ochrany"]
["5498","Oddělení nemocniční hygieny"]
["5602","IOP - komplex.technol.vyb.v obl. sterilizace prádla"]
["5606","IOP - Mod.tech.vyb.v oblasti prevence nozokomiál.infek."]
["5674","IROP - Mod.obn.vyb.přístr.onkogynekol.cen."]
["5676","IROP - Návazná péče"]
["5681",""]
["5684",""]
["5693","Oddělení centrální sterilizace"]
["5695","OCS - detašované pracoviště Ortopedie"]
["5696","OCS - detašované pracoviště  DK"]
["5721","Nutriční ambulance"]
["5921",""]
["5931","JIP 51"]
["5976","IROP - Návazná péče"]
["5982","Rezidenti 2015 - nelékařské obory"]
["6001","Vedení klinického pracoviště"]
["6002","OP LZZ vzdělávání lékařů"]
["6005","IOP - Mod.obn.přístr.vyb.traumatologického c."]
["6022","Ambulance"]
["6023","Triážová ambulance - COVID-19"]
["6024","Ambulance"]
["6025","LPS dospělá"]
["6026","Akutní traumatologická ambulance"]
["6027","Odběrový stan - COVID-19"]
["6028","Traumatologický plán FNOL"]
["6029","Emergency"]
["6083","Rezidenti 2016 - ošetřovatelská a intenzivní péče"]
["6087","URGENT: rezidenti 2020 - lékaři"]
["6088","Rezidenti 2017 - nelékařské obory"]
["6206","Centrum klinického výzkumu"]
["8101","Klinická hodnocení - I. Interní klinika"]
["8102","Klinická hodnocení - II. Interní klinika"]
["8103","Klinická hodnocení - III. Interní klinika"]
["8104","Klinická hodnocení - I. Chirurgická klinika"]
["8105","Klinická hodnocení - II. Chirurgická klinika"]
["8106","Klinická hodnocení - Neurochirurgická klinika"]
["8107","Klinická hodnocení - Klinika anesteziologie a resuscitace"]
["8108","Klinická hodnocení - Porodnicko-gynekologická klinika"]
["8109","Klinická hodnocení - Novorozenecké oddělení"]
["8110","Klinická hodnocení - Dětská klinika"]
["8111","Klinická hodnocení - Ortopedická klinika"]
["8112","Klinická hodnocení - Urologická klinika"]
["8113","Klinická hodnocení - Otolaryngologická klinika"]
["8114","Klinická hodnocení - Oční klinika"]
["8115","Klinická hodnocení - Oddělení alergologie a kl.imun."]
["8116","Klinická hodnocení - Klinika plicních nemocí a tuberkulózy"]
["8117","Klinická hodnocení - Neurologická klinika"]
["8118","Klinická hodnocení - Klinika psychiatrie"]
["8119","Klinická hodnocení - Klinika pracovního lékařství"]
["8120","Klinická hodnocení - Klinika chorob kožních a pohlavních"]
["8121","Klinická hodnocení - Onkologická klinika"]
["8122","Klinická hodnocení - Klinika nukleární medicíny"]
["8124","Klinická hodnocení - Klinika zubního lékařství"]
["8125","Klinická hodnocení - Klinika ústní, čelistní a obl. chir."]
["8126","Klinická hodnocení - Oddělení rehabilitace"]
["8127","Klinická hodnocení - Klinika TVL a kardiovask rehabilitace"]
["8128","Klinická hodnocení - Ústav lékařské genetiky a fet. med."]
["8129","Klinická hodnocení - Oddělení plastické a estet. chirurgie"]
["8130","Klinická hodnocení - Oddělení geriatrie"]
["8131","Klinická hodnocení - Traumatologické oddělení"]
["8132","Klinická hodnocení - Hemato-onkologická klinika"]
["8133","Klinická hodnocení - Oddělení klinické biochemie"]
["8134","Klinická hodnocení - Radiologická klinika"]
["8135","Klinická hodnocení - Transfuzní oddělení"]
["8136","Klinická hodnocení - Oddělení klinické logopedie"]
["8137","Klinická hodnocení - Ústav klinické a molekulární patologie"]
["8138","Klinická hodnocení - Ústav soud. lékařství a medicin.práva "]
["8139","Klinická hodnocení - Oddělení klinické psychologie"]
["8140","Klinická hodnocení - Ústav mikrobiologie"]
["8141","Klinická hodnocení - Ústav imunologie"]
["8143","Klinická hodnocení - Ústav farmakologie"]
["8144","Klinická hodnocení: Laboratoř experimentální medic"]
["8145","Klinická hodnocení - Sociální oddělení"]
["8146","Klinická hodnocení - Transplantační centrum"]
["8147","Klinická hodnocení - Centrální operační sály"]
["8148","Klinická hodnocení - Lékárna"]
["8150","Klinická hodnocení - Kardiochirurgická klinika"]
["8153","Klinická hodnocení - Oddělení lék. fyziky a rad. ochrany"]
["8156","Klinická hodnocení - Oddělení centrální sterilizace "]
["8159","Klinická hodnocení - Oddělení int. péče chirurg. oborů"]
["8160","Klinická hodnocení - Oddělení urgentního příjmu"]
["8501","Prof. MUDr. Petr Kaňovský, CSc. - NEUROL"]
["8502","Doc.MUDr. Mgr. Milan Raška, Ph.D. - IMUNOL"]
["8503","Prof. MUDr. Miloš Táborský, CSc., FESC, MBA - I.IK"]
["8504","Prof. MUDr. Miloš Táborský, CSc., - I.IK - TAČR"]
["8505","MUDr. Martin Nevrlý, Ph.D. - NEUROL"]
["8506","MUDr. Petr Džubák, Ph.D. - DK/GEN"]
["8507","Prof. MUDr. Vítězslav Kolek, DrSc. - PLIC"]
["8508","Prof. MUDr. Miloš Táborský, CSc., FESC, MBA - I.IK"]
["8509","Doc. MUDr. Daniel Šaňák, PhD. - NEUROL"]
["8510","Doc. MUDr. Petr Hamal, PhD. - MIKRO"]
["8511","Prof. MUDr. Radovan Pilka, PhD. - PORGYN"]
["8512","Grant: MUDr. Martin Loveček, PhD. - I. CHIR"]
["8513","Grant: MUDr. Martin Šín, PhD., FEBO - OČNÍ"]
["8514","Grant: Doc. MUDr. Miroslav Vaverka, CSc. - NEUROCH"]
["8515","Grant: Doc. Dr. Ing. Eva Kriegová - IMUNO"]
["8516","Grant: Prof. RNDr. Tomáš Adam, PhD. - OKB"]
["8517","Grant: Ing. David Kula, PhD., MBA - I.IK"]
["8518","Grant: MUDr. Jan Hálek, Ph.D."]
["8519","Grant: Ing. Antonín Hlavinka"]
["8531","MUDr. Tomáš Szotkowski, Ph.D. - HOK"]
["8532","Prof.MUDr. Zdeněk Kolář, CSc. - PATOL"]
["8533","MUDr. Milan Král, Ph.D. - UROL"]
["8534","Doc. MUDr. František Mrázek, Ph.D. - IMUNOL"]
["8535","MUDr. Vladimír Balík, Ph.D. - NEUROCHIR"]
["8536","Doc. RNDr. Radek Vrtěl, Ph.D. - GENETIKA"]
["8537","MUDr. Michela Kaiserová - NEUROL"]
["8538","MUDr. David Vrána, Ph.D. - ONKO"]
["8539","MUDr. Tomáš Pika, Ph.D. - HOK"]
["8540","Dr. Ing. Eva Kriegová - IMUNO"]
["8541","MUDr. Richard Salzman, Ph.D. - ORL"]
["8542","Prof. MUDr. Jiří Ehrmann, Ph.D. - PATOL"]
["8543","Prof. MUDr. Bohuslav Melichar, Ph.D. - ONKO"]
["8544","MUDr. Jana Volejníková, Ph.D. - DK"]
["8545","MUDr. Hana Študentová, Ph.D. - ONKO"]
["8546","Dr. Ing. Eva Kriegová - IMUNO"]
["8547","Doc. MUDr. Vít Procházka, Ph.D. - HOK"]
["8548","MUDr. Pavel Skalický, Ph.D. - I.CHIR"]
["8549","Prof. MUDr. Miloš Táborský, CsC. - I.IK - TAČR"]
["8550","MUDr. Hana Študentová, Ph.D. - ONKO - GAČR"]
["8551","Doc. MUDr. Vladimír Študent, PhD. - UROL"]
["8552","Doc. MUDr. Jiří Minařík, PhD. - HOK"]
["8553","MUDr. Hana Študentová, Ph.D. - ONKO"]
["8554","MUDr. Pavel Skalický, PhD. - I.CHIR"]
["8555","Doc. RNDr. Radek Vrtěl, PhD. - GENETIKA"]
["8556","MUDr. Tomáš Veverka, PhD. - NEUROL"]
["8557","MUDr. Petr Šantavý, PhD. - KARDIOCHIR"]
["8558","MUDr. Filip Čtvrtlík, PhD. - RTG"]
["8559","MUDr. JUDr. Dušan Klos, Ph.D. - I.CHIR"]
["8560","Mgr. Lenka Kocourková - LEM"]
["8561","MUDr. Ondřej Krystyník - III. IK"]
["8562","Mgr. Taťána Štosová, Ph.D. - MIKRO"]
["8563","Doc. MUDr. Jan Minařík, Ph.D. - HOK"]
["8564","MUDr. Jan Přeček, Ph.D. - I.IK"]
["8565","Prof. MUDr. Ing. Petr Hluštík, Ph.D. - NEUROL"]
["8566","MUDr. Michaela Kaiserová - NEUROL"]
["8567","MUDr. Jana Petřková, Ph.D. - I.IK"]
["8568","Prof. MUDr. Dagmar Pospíšilová, Ph.D. - DK"]
["8569","MUDr. Přemysl Falt, Ph.D. - II.IK"]
["8570","Prof. MUDr. Bohuslav Melichar, Ph.D. - ONKO"]
["8571","MUDr. Tomáš Skála, Ph.D., FESC - I.IK"]
["8572","Grant: Doc. MUDr. Petr Šantavý, Ph.D. - KARDIOCHIR"]
["8573","Grant: MUDr. Jan Přeček, PhD. - I.IK"]
["8574","Grant: Doc. MUDr. Kateřina Menšíková, PhD. - NEURO"]
["8575","Grant: Doc. MUDr. Miroslav Vaverka, CSc. - NEUROCH"]
["8576","Grant: MUDr. Vladislav Raclavský, PhD. - MIKRO"]
["8577","Grant: Prof. MUDr. Bohuslav Melichar, Ph.D. - ONKO"]
["8578","Grant: Prof. MUDr. Mgr. Milan Raška, PhD. - IMUNO"]
["8579","Grant: Prof. MUDr. Dagmar Pospíšilová, PhD. - DK"]
["8580","Grant: Doc. MUDr. Martin Doležel, PhD. - ONKOL"]
["8581","Grant: Doc. MUDr. Ondřej Urban, PhD. - II. IK"]
["8582","Grant: MUDr. Tomáš Skála, PhD. FESC - I. IK"]
["8599","Granty - pomocné středisko"]
["8617","MUDr. Michal Král - NEUROL"]
["8618",""]
["8619","Grant: Doc. MUDr. Jiří Gallo, Ph.D. - ORTOP"]
["8620","Doc.MUDr.Marek Ĺubušký, Ph.D. - PORGYN"]
["8621","Prof.MUDr. Petr Kaňovský, CSc. - NEUROL"]
["8622","Grant: Doc.MUDr. Edgar Faber, CSc. - HOK"]
["8623",""]
["8625","Doc. MUDr. Milan Adamus, Ph.D. - KARIM"]
["8626","Doc. MUDr. Jiří Gallo, Ph.D. - ORTOP"]
["8627","Prof. MUDr. Vladimír Mihál, CSc. - DK"]
["8628","Doc. MUDr. Čestmír Neoral, CSc. - I.CHIR"]
["8629","Doc. MUDr. Daniel Šaňák, Ph.D. - NEUROL"]
["8631","Doc. MUDr. Petr Utíkal, Ph.D. - 2.CHIR"]
["8632","MUDr. Petr Jakubec - PLICNÍ"]
["8633","Mgr. T. Štosová, Ph.D./MUDr. M.Sedláková, Phd.D. - MIKRO"]
["8634","MUDr. Zuzana Heřmanová - IMUNOL"]
["8635","Mgr. Luděk Slavík, Ph.D. - HOK"]
["8636","Mgr. T. Štosová, Ph.D./MUDr. M.Sedláková, Phd.D. - MIKRO"]
["8637","MUDr. Tomáš Pika, Ph.D. - 3.IK"]
["8638","MUDr. Vít Procházka - HOK"]
["8639","Prof. MUDr. Jiří Klein, Ph.D. - ONKOL"]
["8640","MUDr. Pavel Otruba, MBA - NEUROL"]
["8641","Doc. MUDr. Marie Nakládalová, Ph.D. - PRAC"]
["8642","MUDr. Tomáš Wanek - NEUROCHIR "]
["8643","Doc.MUDr.Milan Adamus, Ph.D. - KARIM"]
["8644","Doc. MUDr. Martin Procházka, Ph.D. - PORGYN"]
["8645","Prof. MUDr. Vítězslav Kolek, DrSc. - PLIC"]
["8646","Doc. MUDr. Dagmar Pospíšilová, Ph.D. - DK"]
["8647","Doc. MUDr. Igor Čižmář, Ph.D. - TRAUMA"]
["8648","Doc. Mgr. Jiří Drábek, Ph.D.  - TAČR"]
["8649","Prof. MUDr. Jiří Gallo, Ph.D. - ORTOP"]
["8665","Grant: prof. MUDr. Zdeněk Kolář, CSc. - PATOL"]
["8667","MUDr. Luděk Raida, Ph.D. - HOK"]
["8671","Grant: Doc. MUDr. Petr Utíkal, Ph.D. - 2 CHIR"]
["8672","Grant: MUDr. Ondřej Kalita, Ph.D. - NCHIR"]
["8673","Grant: Doc. MUDr. Ivana Oborná, Ph.D. - PORGYN"]
["8676","Prof. MUDr. Vítězslav Kolek, DrSc. - PLIC"]
["8680","Doc.MUDr. Tomáš Papajík, CSc. - HOK"]
["8681","Prof.MUDr. Martin Petřek, CSc. - OKB"]
["8682","Prof.MUDr. Martin Petřek, CSc. - OKB"]
["8683","Prof.MUDr. Vítězslav Kolek, DrSc. - PLIC"]
["8684","Prof.MUDr. Josef Zadražil, CSc - 3.IK"]
["8685","MUDr. Karel Cwiertka, Ph.D. - ONKOL"]
["8686","Doc.MUDr. Radovan Pilka, Ph. D. - PORGYN"]
["8687","MUDr. Ivona Grygárková - PLIC"]
["8688","Prof. MUDr. Jiří Ehrmann, Ph. D. - PATOL"]
["8689","Prof.MUDr. Petr Hluštík, Ph.D. - NEUROL"]
["8690","Doc.MUDr. Tomáš Papajík, CSc. - HOK"]
["8691","MUDr. Ondřej Kalita, Ph.D. - NCHIR"]
["8692","Grant: MUDr. Jan Gregar - 2.IK"]
["8693","Prof.MUDr. Karel Indrák, DrSc. - HOK"]
["8694","Doc.MUDr.Petr Utíkal, Ph.D. - 2. CHIR"]
["8695","Grant: Doc. MUDr. Peter Ondra, CSc. - SOUDNÍ"]
["8696","MUDr. Jan Gregar - 2. IK"]
["8697","Prof.MUDr. Pavel Horák, CSc. - 3.IK"]
["8698","MUDr. Dušan Klos, Ph. D. - I.CHIR"]
["8699","Granty - pomocné středisko"]
["8705","RIV: MUDr. Kateřina Čerňanová"]
["8709","RIV: MUDr. Aleš Grambal, PhD."]
["8710","RIV: MUDr. Štefan Trnka"]
["8711","RIV: doc. Mgr. Jan Bouchal, PhD."]
["8712","RIV: prof. MUDr. Jiří Gallo, PhD."]
["8713","RIV: MUDr. Matěj Halaj"]
["8715","RIV: MUDr. Karel Huml"]
["8716","RIV: MUDr. Beáta Hutyrová, PhD."]
["8719","RIV: MUDr. Hana Klosová, PhD."]
["8720","RIV: MUDr. Petr Kolář, PhD."]
["8721","RIV: MUDr. Andrea Smržová"]
["8724","RIV: MUDr. Vladimír Študent, PhD."]
["8725","RIV: MUDr. Helena Urbánková"]
["8726","RIV: Mgr. Petr Vrtěl"]
["8729","RIV: prof. MUDr. Vít Procházka, PhD."]
["8730","RIV: MUDr. Špička, PhD."]
["8735","RIV: MUDr. Petra Hübnerová"]
["8736","RIV: MUDr. Josef Chudáček"]
["8737","RIV: MUDr. Jana Janečková, PhD."]
["8738","RIV: MUDr. Jan Schovánek, PhD."]
["8739","RIV: doc. MUDr. Martin Šimek, PhD."]
["8752","RIV: 2016 - Doc. MUDr. Daniel Šaňák, Ph.D."]
["8753","RIV: MUDr. Richard Salzmann, Ph.D."]
["8754","RIV: 2016 - Doc. MUDr. David Karásek, Ph.D."]
["8755","RIV - MUDr. Roman Hájek, Ph. D. "]
["8757","RIV: 2016 - MUDr. JUDr. Dušan Klos, Ph.D."]
["8758","RIV: 2016 - MUDr. Tomáš Pika, Ph.D."]
["8760","RIV: RNDr. Martin Novák, Ph.D."]
["8761","RIV - MUDr. Jana Volejníková, Ph. D. "]
["8762","RIV - Doc. MUDr. David Karásek, Ph. D. "]
["8763","RIV: 2017 - MUDr. Richard Salzmann, Ph.D."]
["8764","RIV: 2017 - MUDr. Kateřina Menšíková, Ph.D."]
["8765","RIV - Doc. MUDr. František Mrázek, Ph. D. "]
["8766","RIV - MUDr. Adam Kuba"]
["8767","RIV - Prof. MUDr. Jiří Gallo, Ph. D. "]
["8768","RIV - Doc. MUDr. Karel Krejčí, Ph. D. "]
["8769","RIV: 2017 - Doc. MUDr. Radek Vodička, Ph.D."]
["8770","RIV: MUDr. Barbora Ludíková, Ph.D."]
["8771","RIV: 2017 - Doc. MUDr. Radek Vrba, Ph.D."]
["8772","RIV: 2017 - Mgr. Luděk Slavík, Ph.D."]
["8773","RIV - MUDr. Jan Hálek, Ph.D."]
["8774","RIV: 2017 - MUDr. Milan Král, Ph.D."]
["8775","RIV: 2017 - MUDr. Hana Suchánková, Ph.D."]
["8776","RIV: 2017 - MUDr. Jiří Kysučan, Ph.D."]
["8777","RIV: Prof. MUDr. Radovan Pilka, Ph.D."]
["8778","RIV: 2017 - Mgr. Lukáš Najdekr"]
["8779","RIV - MUDr. Anna Medková"]
["8780","RIV - MUDr. Eva Karásková"]
["8781","RIV - Doc. MUDr. Jiří Minařík, Ph. D. "]
["8782","RIV - RNDr. Pavlína Čapková, Ph. D. "]
["8783","RIV - MUDr. Eva Klásková, Ph. D. "]
["8784","RIV - MUDr. Jan Hanuliak"]
["8785","RIV - Doc. MUDr. Martin Hutyra, Ph. D. "]
["8786","RIV - MUDr. Pavel Hok"]
["8787","RIV - Dr. Gvansta Kharaishvili, Ph. D. "]
["8788","RIV - MUDr. Richard Salzman, Ph. D. - MEX "]
["8789","RIV - Doc. MUDr. Kateřina Menšíková, Ph. D. - MEX "]
["8790","Institucionální podpora - RIV"]
["8791","RIV - Doc. Mgr. Luděk Slavík, Ph. D. - MEX "]
["8792","RIV - Prof. MUDr. Jiří Gallo, Ph. D. - MEX "]
["8793","RIV: prof. MUDr. Milan Raška, PhD. - MEX"]
["8794","RIV: MUDr. Martin Loveček, PhD. - MEX"]
["8795","RIV: doc. MUDr. Martin Vrba , PhD. - MEX"]
["8796","RIV: doc. MUDr. Přemysl Falt, PhD. - MEX"]
["8797","RIV: prof. MUDr. Jiří Gallo, PhD. - MEX"]
["8798","RIV: prof. MUDr. Miloš Táborský, PhD. - MEX"]
["8799","RIV: doc. MUDr. Radek Vodička, PhD. - MEX"]
["8981","Úsek klinických studií"]
["8988","Pomocné středisko"]
["8999","Rozdíly zdravotních pojišťoven"]
["9001","Úsek ředitele"]
["9002","Kaple konto darů"]
["9003","Etická komise"]
["9004",""]
["9005","IOP Mod.a obnova přístroj.vyb.komplex.rehab.péče"]
["9006",""]
["9007",""]
["9008","IOP - Mod.obn.přístr.vyb.c.k.onkologické p. II"]
["9009","IOP - Mod.obn.přístr.vyb.cerebrovaskulárního centra FNOL"]
["9010","Organizace plesu FN"]
["9011","IOP- Mod.obn.přistr.vyb.komplex.kardiovas.centra"]
["9012","IOP - Mod.tech.vyb.v oblasti prevence nozokomiál.infek."]
["9013",""]
["9014",""]
["9015","IOP - Mod.obn.přístr.vyb.traumatologického c."]
["9016","Projekt OP RLZ"]
["9017",""]
["9018","Projekt WHO - HPH standardy"]
["9019",""]
["9021","Úsek léčebné péče"]
["9022","Konto darů - vzdělávání FNOL"]
["9023",""]
["9024",""]
["9025","Nemocniční dietolog"]
["9026","IOP - Mod.tech.vyb.v oblasti prevence nozokomiál.infek."]
["9027","Dárcovský konzultant"]
["9028","Oddělení vědy a výzkumu"]
["9029","Paliativní péče"]
["9031","Odbor hlavní sestry"]
["9032","Oddělení léčebné výživy"]
["9033",""]
["9034","Projekt vzdělávání nelék. oborů ve FNOL "]
["9035","E-learningová podpora výuky zdrav.info.pro střed.zdrav.personál"]
["9036","Dobrovolnické centrum FNOL"]
["9041","Útvar ekonomiky a zdravotních pojišťoven"]
["9042","Dotace PAP"]
["9043",""]
["9044",""]
["9045",""]
["9046","Ostatní náklady - pouze FKSP"]
["9051","Útvar hospodářsko technické správy"]
["9052",""]
["9054",""]
["9058",""]
["9059",""]
["9060",""]
["9061","Odbor investic"]
["9062",""]
["9063","IU: Odbor hlavního energetika"]
["9064",""]
["9065",""]
["9066",""]
["9067",""]
["9068",""]
["9069",""]
["9071","Personální úsek"]
["9072",""]
["9074",""]
["9075","IOP - Mod.obn.přístr.vyb.traumatologického cen. II"]
["9076","Školení KPR"]
["9077","IOP - Mod.obn.přístr.vyb.c.k.onkologické p. III"]
["9081","Úsek informačních technologií"]
["9082","Odbor informatiky"]
["9083",""]
["9084","Oddělení centrální spisovny"]
["9085","Oddělení telefonní ústředny"]
["9086","NIS (Nemocniční inf. systém)"]
["9087",""]
["9088",""]
["9089","IOP-zvýš.efekt.v oblasti diag. procesů (RTG)"]
["9091","Obchodní úsek"]
["9092",""]
["9093",""]
["9094",""]
["9095",""]
["9096","Odbor marketingu"]
["9097",""]
["9101","Petřivalského - Rapantův den "]
["9102","Markův den "]
["9103","Světový den dárců krve "]
["9104","Workshop vrchních sester a vedoucích laborantů "]
["9105","Pracovní konference III. Interní kliniky "]
["9106","Pracovní den - sekce mladých chirurgů "]
["9107","Dermatologická konference "]
["9108","Hirschův den "]
["9109","Pracovní seminář region. ARO a HDS CTR FNOL "]
["9110","Den sester perioperační péče "]
["9111","Olomoucký podiatrický pracovní den "]
["9112","Luklův kardiologický den "]
["9113","Regionálni sesterská kardiologická konference "]
["9114","Kampaň - dárcovství krve"]
["9115","Konference prenatál.diagnostiky.a fetální medicíny"]
["9116","Moravský kazuistický seminář - Kožní klinika"]
["9117","Kardiologická ROAD SHOW"]
["9118","Konference pediatrů a dětských sester"]
["9119","II. IK - nové možnosti v léčbě chronické hepatitidy C"]
["9120","Lymeská borelióza"]
["9121","Krajský alergologicko-imunologický seminář"]
["9122","Konto darů - vzdělávání-konference FNOL"]
["9123","Bezpečná aplikace do cévního řečiště"]
["9124","Hospital Management"]
["9125","Novinky v asistované reprodukci"]
["9126","II. IK - Stop dekubitům"]
["9127","Dětská klinika - Seminář mladých lékařů"]
["9128","Echokardiografický kurz I+II"]
["9129","Hojení ran v kostce"]
["9130","Celostátní konference DNA diagnostiky"]
["9131","Seminář pro odborníky pro nemoci z povolání"]
["9132","Seminář \"Nový zákon o veřejných zakázkách\""]
["9133","Kongres českých a slovenských dětských chirurgů"]
["9134","Odborná konference plicní kliniky"]
["9135","Simulační medicína KARIM"]
["9136","OKB - workshop"]
["9137","Seminář - náročné situace zdrav. praxe"]
["9138","Rozmaričovy soudně-lékařské pracovní dny"]
["9139","Workshop - Bioremodelace laxity kůže"]
["9140","Seminář \"Přínos molekulární detekce patogenů\""]
["9141","Seminář \"Aktuality v nemocničním lékarenství\""]
["9142","Pracovní dny chirurgie baze lební"]
["9143","Kvalifikační kurz SANITÁŘ"]
["9144","Péče o pacienty se žilními vstupy"]
["9145","Zavádění žilních vstupů pod UZ kontrolou"]
["9146","Péče o pacienty s parenterální výživou - domácí prostředí"]
["9147","Český národní kongres léčby malignit peritoneálního povrchu"]
["9148","MA FNOL: Konference a vzdělávací akce TO"]
["9149","MA FNOL: Pracovní dny OKB - dědičné metab. poruchy"]
["9150","MA FNOL: Konference PORGYN"]
["9151","MA FNOL: Běh za zdraví"]
["9152","MA FNOL: Spolupráce geriatrie a následné péče"]
["9153","MA FNOL: Gastrokurzy"]
["9154","MA FNOL: Olomouc Live endoskopy"]
["9155","MA FNOL: Best of Astro"]
["9204","Areál FNOL"]
["9205","Projekt SMO-zpřístupnění fort. pevnosti v areálu FNOL"]
["9206","Projekt OL kraje-zpřístupnění fort. pevnosti v areálu FNOL"]
["9207","\"Pevnůstka\" - archív "]
["9208","Údrž. Provoz.: OPŽP Regenerace zeleně v FN Olomouc"]
["9209","Areál - ulice Profesora Fuky"]
["9301","Sklad ZPr (sledování režijních nákladů pracoviště)"]
["9305","Ostatní provozy,sklady,stěhovací četa"]
["9306","Ostraha FNOL"]
["9308","Parková skupina"]
["9401","Provoz prádelny"]
["9402","Provoz dopravy - sanitní - převoz pacientů ve FNOL"]
["9403","Provoz dopravy - osobní"]
["9404","Provoz dopravy - nákladní"]
["9405","Provoz dopravy - sanitní - převoz zdrav. pojišťovny"]
["9409","Údržba stavební"]
["9410","Údržba ZVIT"]
["9411","Provoz potrubní pošty"]
["9412","Poro. služby: Provoz distribuce prádla"]
["9501","Provoz stravování - ostatní stravování"]
["9502","Provoz stravování - tablet, pacientská strava"]
["9503","Provoz stravování - Kantýna"]
["9504",""]
["9505","Provoz stravování - vlastní výroba"]
["9506","IOP - Mod.tech.vyb.v oblasti prevence nozokomiál.infek."]
["9601","Ubytovny"]
["9655","Byty "]
["9701","Stavební úpravy neurologie"]
["9702","Přístavba objektu P pro HOK "]
["9703","Stavby: SÚ dospávací haly v objektu A /KARIM"]
["9704","SÚ realizace KTVL"]
["9705","Parkoviště u lékárny"]
["9706","Rekonstrukce zákrokového sálu - ORT"]
["9707","Stavby: Vjezdový závorový systém"]
["9708","SÚ modernizace jídelny - Provoz stravování"]
["9710","Parkování pod Dětskou klinikou"]
["9712","Stavby: SÚ operační sál č. 2 v 3NP / NCHIR"]
["9713","Napojení areálu Hněvotínská"]
["9714","SÚ objektu M1 a M2 - NEUR"]
["9715","SÚ vstupů do budovy D1 a D2"]
["9716","Stavby: SÚ 1.NP a 1.PP/ORL"]
["9717","Stavby: SÚ JIRP / DK"]
["9719","Stavby: SÚ objektu D - únikové cesty"]
["9720","Stavby: Lapák tuků"]
["9721","Stavby: Onkologický stacionář"]
["9723","Stavby: SÚ pracoviště sterilizace v 1. PP/ORT"]
["9724","Stavby: Rekonstrukce 1.PP skladu potravin"]
["9725","Stavby: SÚ 2.NP objektu A"]
["9736","Stavby: Zateplení KZL"]
["9738","Stavby: SÚ RTG kliniky - budova A/1.PP"]
["9739","Stavby: SÚ objektu U - PSY"]
["9743","Stavby: SÚ pro přemístění 1 IK"]
["9745","SÚ JIP a arytmologie I. IK"]
["9751","Potrubní pošta"]
["9753","Stavby: Ozařovací rentgen ONK"]
["9754","Zateplení 3IK + KNM"]
["9756","Stavby: Centralizace dětské operativy"]
["9759","Zateplení  OKB "]
["9760","Stavby: SÚ pro IOP ONKO II - RTG"]
["9761","Stavby: SÚ pro IOP ONKO II - KNM"]
["9762","Zateplení ORT"]
["9763","Investice - výstavba TO"]
["9764","Zateplení DK"]
["9765","Příprava rekonstrukce hlavní budovy"]
["9767","Zateplení a bezbariérovost KZL"]
["9768","Novostavba 2IK a Geriatrie"]
["9769","SÚ budovy D2 - zřízení NIP a DIOP"]
["9770","Úprava LEK v budově A"]
["9772","Přesun laboratoří HOK z budovy K do budovy P"]
["9773","Stavby: Zdroj chladu pro objekt \"A\""]
["9774","Stavby: Chodníky areálu FNOL"]
["9776","Stavby: Fort Tafelberg, úprava jižního bloku"]
["9777","Stavba - NTMC Národní telemedicínské centrum"]
["9779","Laboratoře GEN/T"]
["9780","Stavby: Rekonstrukce výtahů"]
["9782","Stavby: Nástavba budovy A"]
["9783","Radiofarmaka KNM"]
["9788","Stavby: SÚ objektu I - 1.PP / OKB"]
["9792","Stavby: Úprava prac. děts. alergolog. a pneumolog."]
["9799","Stavby: Lékárna - novostavba"]
["9801","Krizová připravenost - MZ"]
["9802","Zdravotní výchova - MZ"]
["9803","Výuka studentů - MZ"]
["9804","Čítárna - knihovna - MZ"]
["9805","Program bezpečnosti a kvality zdrav. péče - MZ"]
["9806","Krizová připravenost - MZ - příjem hromad.postižení osob"]
["9807","Krizová připravenost - Traumateam ČR - RAFEX 2014"]
["9808","TranMZČR: Zvýšení ochr. měkkých cílů v res.zdr.-MZ"]
["9809","TranMZČR: Psychosoc. podpora zdrav. prac.v 2020-MZ"]
["9810","TranMZČR: Zabezpečení svoláv. a varovného sys.-MZ"]
["9811","TranMZČR: Zvýšení ochr.měkkých cílů-2-zubní kl.-MZ"]
["9812","Refundace ZO OS, SČL,Unie sester "]
["9813","MEDEVAC"]
["9814","Konference \"Zdraví v Evropě\" (Norské fondy)"]
["9815","Komunikační kampaň FNOL (nekuřácká nemocnice)"]
["9816","Projekt WHO - HPH konference "]
["9817","Personální stabilizace ve zdravotnictví"]
["9818","Systém psychosociální intervenční služby SPIS"]
["9819","TranMZČR: Bezpečnost a kvalita zdravotní péče"]
["9901","Pronájmy Areál FNO"]
["9910","Pronájmy Areál Hněvotínská vč.kotelny"]
["9920","Pronájmy Areál Heliport"]
["9930","Pronájmy Areál Karafiátova"]
["9940","Pouze energie"]
["9950","Pronájem reklamních ploch"]
["9998","Daň z nemovitosti + různé"]
["9999","Pomocné středisko pro inter. potřeby"]