{"text_format":"1","workbook":"xlsx","n_sheets":6,"sheets":["Intro","Summary","1_Původní","2_Upravený","3_Rozdíly","CisNS"],"not_rendered":{"charts":0,"images":2,"macros":1,"external_links":0,"defined_names":1,"comments":0,"pivot_tables":0},"unopened":[],"bounds":{"document_bytes":16777216,"sheet_cells":100000,"rows_first":2000,"rows_last":500,"rows_between":2000,"halvings":0,"cell_chars":16384,"cell_head_chars":4096},"cells_cut":0,"cells_raw":0,"read":"whole","date_system":"1900"}

{"sheet":"Intro","index":0,"n_rows":5,"n_cols":2,"rows_kept":5,"cut":false,"hidden":false,"merged":[]}
[]
[null,"Pro správnou funkčnost šablony je zapotřebí povolit makra."]
[null,"A jelikož nemáte makra povolená, zobrazuje se tento list."]
[null,"Makra povolíte v menu Soubor/Možnosti/Centrum zabezpečení/Nastavení centra zabezpečení/ Nastavení maker a zaškrtněte volbu Povolit všechny makra"]
[null,"Po povolení maker šablonu zavřete a otevřete znovu."]

{"sheet":"Summary","index":1,"n_rows":30,"n_cols":7,"rows_kept":30,"cut":false,"hidden":true,"merged":[[7,3,7,5],[7,1,8,2],[26,1,27,2],[26,3,27,3]]}
[null,null,null,null,null,null,{"$f":"SUM(F:F)","v":0}]
[null,"Plánovací proces 2021 - šablona pro úpravu návrhu rozpočtu analytického účtu do středisek a měsíců"]
[]
[null,"Garant","OPP"]
[null,"Jméno","Ing. Jarmila Neudörflerová"]
[null,"Email","Jarmila.Neudorflerova@fnol.cz"]
[]
[null,"Analytický účet",null,"Rozpočet"]
[null,null,null,"1_Původní","2_Upravený","3_Rozdíly"]
[null,64908009,"Smlouva o účelově vázané úplatě",{"$f":"IFERROR(VLOOKUP(B10,'1_Původní'!A:P,16,FALSE),0)","v":215000},{"$f":"IFERROR(VLOOKUP(B10,'2_Upravený'!A:P,16,FALSE),0)","v":215000},{"$f":"ROUND(E10-D10,0)","v":0}]
[null,64924438,"Výkony etické komise",{"$f":"IFERROR(VLOOKUP(B11,'1_Původní'!A:P,16,FALSE),0)","v":2300000},{"$f":"IFERROR(VLOOKUP(B11,'2_Upravený'!A:P,16,FALSE),0)","v":2300000},{"$f":"ROUND(E11-D11,0)","v":0}]
[null,64924439,"Klinické hodnocení - tuzemci (81xx,9003,9028)",{"$f":"IFERROR(VLOOKUP(B12,'1_Původní'!A:P,16,FALSE),0)","v":35199999.999700002},{"$f":"IFERROR(VLOOKUP(B12,'2_Upravený'!A:P,16,FALSE),0)","v":35199999.999700002},0]
[null,64924440,"Klinické hodnocení - EU (81xx,9003,9028)",{"$f":"IFERROR(VLOOKUP(B13,'1_Původní'!A:P,16,FALSE),0)","v":6339999.9998000003},{"$f":"IFERROR(VLOOKUP(B13,'2_Upravený'!A:P,16,FALSE),0)","v":6339999.9707000013},0]
[null,64924441,"Klinické hodnocení - 3.země (81xx,9003,9028)",{"$f":"IFERROR(VLOOKUP(B14,'1_Původní'!A:P,16,FALSE),0)","v":6899999.9997999985},{"$f":"IFERROR(VLOOKUP(B14,'2_Upravený'!A:P,16,FALSE),0)","v":6899999.9997999985},0]
[null,67101000,"Transfery MZ - ostatní",{"$f":"IFERROR(VLOOKUP(B15,'1_Původní'!A:P,16,FALSE),0)","v":16961000},{"$f":"IFERROR(VLOOKUP(B15,'2_Upravený'!A:P,16,FALSE),0)","v":16961000},0]
[null,67101001,"Transfery MZ na VaV - věcné náklady",{"$f":"IFERROR(VLOOKUP(B16,'1_Původní'!A:P,16,FALSE),0)","v":2828999.9999000002},{"$f":"IFERROR(VLOOKUP(B16,'2_Upravený'!A:P,16,FALSE),0)","v":2829000},0]
[null,67101002,"Transfery MZ na VaV - mzdové náklady",{"$f":"IFERROR(VLOOKUP(B17,'1_Původní'!A:P,16,FALSE),0)","v":3874000},{"$f":"IFERROR(VLOOKUP(B17,'2_Upravený'!A:P,16,FALSE),0)","v":3874000},0]
[null,67101006,"Transfery MZ na rezidenční místa",{"$f":"IFERROR(VLOOKUP(B18,'1_Původní'!A:P,16,FALSE),0)","v":8150999.9999999991},{"$f":"IFERROR(VLOOKUP(B18,'2_Upravený'!A:P,16,FALSE),0)","v":8150999.9999999991},0]
[null,67101010,"Transfery MZ - RIV (institucionální podpora)",{"$f":"IFERROR(VLOOKUP(B19,'1_Původní'!A:P,16,FALSE),0)","v":8000000.0001000008},{"$f":"IFERROR(VLOOKUP(B19,'2_Upravený'!A:P,16,FALSE),0)","v":8000000},0]
[null,67101011,"Transfery MZ - MEDEVAC (humanitární program)",{"$f":"IFERROR(VLOOKUP(B20,'1_Původní'!A:P,16,FALSE),0)","v":403000},{"$f":"IFERROR(VLOOKUP(B20,'2_Upravený'!A:P,16,FALSE),0)","v":403000},0]
[null,67102001,"Transfery jiného poskytovatele - VaV věcné",{"$f":"IFERROR(VLOOKUP(B21,'1_Původní'!A:P,16,FALSE),0)","v":4731000.0000999998},{"$f":"IFERROR(VLOOKUP(B21,'2_Upravený'!A:P,16,FALSE),0)","v":4730999.5945999995},0]
[null,67102002,"Transfery jiného poskytovatele - VaV mzdové",{"$f":"IFERROR(VLOOKUP(B22,'1_Původní'!A:P,16,FALSE),0)","v":8910000.0002999995},{"$f":"IFERROR(VLOOKUP(B22,'2_Upravený'!A:P,16,FALSE),0)","v":8910000},0]
[null,67102004,"Transfery jiného poskytovatele - ostatní",{"$f":"IFERROR(VLOOKUP(B23,'1_Původní'!A:P,16,FALSE),0)","v":8405000.0003999993},{"$f":"IFERROR(VLOOKUP(B23,'2_Upravený'!A:P,16,FALSE),0)","v":8405000.0003999993},{"$f":"ROUND(E23-D23,0)","v":0}]
[]
[null,null,null,null,null,{"$f":"ROUND(SUM(F10:F23),0)","v":0}]
[]
[null,"Přehled plánovaných rezerv za garanta"]
[null,null,null,null,null,{"$f":"IF(COUNTIF('2_Upravený'!$Q:$Q,\"Obrat bez specifikace NS\")>0,COUNTIF('2_Upravený'!$Q:$Q,\"Obrat bez specifikace NS\"),\"\")","v":""}]
[null,null,null,null,{"$f":"IF($F$28=\"\",\"\",\"Obrat\")","v":""},{"$f":"IF(COUNTIF('2_Upravený'!$Q:$Q,\"Obrat bez specifikace NS\")>0,SUMIF('2_Upravený'!$Q:$Q,\"Obrat bez specifikace NS\",'2_Upravený'!$P:$P),\"\")","v":""}]
[null,"Bez rezerv"]

{"sheet":"1_Původní","index":2,"n_rows":246,"n_cols":16,"rows_kept":246,"cut":false,"hidden":true,"merged":[]}
["Legenda",null,"Hodnoty v CZK"]
["Účet","Název účtu"]
[null,"NS","Název NS",{"$f":"MID(Summary!$B$2,18,4)&\"01\"","v":"202101"},{"$f":"MID(Summary!$B$2,18,4)&\"02\"","v":"202102"},{"$f":"MID(Summary!$B$2,18,4)&\"03\"","v":"202103"},{"$f":"MID(Summary!$B$2,18,4)&\"04\"","v":"202104"},{"$f":"MID(Summary!$B$2,18,4)&\"05\"","v":"202105"},{"$f":"MID(Summary!$B$2,18,4)&\"06\"","v":"202106"},{"$f":"MID(Summary!$B$2,18,4)&\"07\"","v":"202107"},{"$f":"MID(Summary!$B$2,18,4)&\"08\"","v":"202108"},{"$f":"MID(Summary!$B$2,18,4)&\"09\"","v":"202109"},{"$f":"MID(Summary!$B$2,18,4)&\"10\"","v":"202110"},{"$f":"MID(Summary!$B$2,18,4)&\"11\"","v":"202111"},{"$f":"MID(Summary!$B$2,18,4)&\"12\"","v":"202112"},{"$f":"MID(Summary!$B$2,18,4)&\" celkem\"","v":"2021 celkem"}]
[]
[64908009,"Smlouva o účelově vázané úplatě",null,{"$f":"SUM(D6:D7)","v":0},0,0,75568.2788,0,33948.849300000002,0,0,0,33356.640299999999,0,72126.231599999999,215000]
[null,"4803","OP - specializační vzdělávání klinických farmaceutů",0,0,0,75568.2788,0,33948.849300000002,0,0,0,33356.640299999999,0,72126.231599999999,{"$f":"SUM(D6:O6)","v":215000}]
[]
[]
[64924438,"Výkony etické komise",null,{"$f":"SUM(D10:D11)","v":132976.4454},{"$f":"SUM(E10:E11)","v":167451.82010000001},{"$f":"SUM(F10:F11)","v":201927.1949},{"$f":"SUM(G10:G11)","v":211777.30189999999},{"$f":"SUM(H10:H11)","v":226552.46249999999},{"$f":"SUM(I10:I11)","v":132976.4454},{"$f":"SUM(J10:J11)","v":216702.35550000001},{"$f":"SUM(K10:K11)","v":197002.14129999999},{"$f":"SUM(L10:L11)","v":128051.3919},{"$f":"SUM(M10:M11)","v":221627.40900000001},{"$f":"SUM(N10:N11)","v":251177.73019999999},{"$f":"SUM(O10:O11)","v":211777.30189999999},{"$f":"SUM(P10:P11)","v":2300000}]
[null,"9003","Etická komise",132976.4454,167451.82010000001,201927.1949,211777.30189999999,226552.46249999999,132976.4454,216702.35550000001,197002.14129999999,128051.3919,221627.40900000001,251177.73019999999,211777.30189999999,{"$f":"SUM(D10:O10)","v":2300000}]
[]
[]
[64924439,"Klinické hodnocení - tuzemci (81xx,9003,9028)",null,{"$f":"SUM(D14:D27)","v":885232.74040000001},{"$f":"SUM(E14:E27)","v":3562594.5710999998},{"$f":"SUM(F14:F27)","v":4268226.5504000001},{"$f":"SUM(G14:G27)","v":4238089.1201999998},{"$f":"SUM(H14:H27)","v":717306.03979999991},{"$f":"SUM(I14:I27)","v":1511824.4939000001},{"$f":"SUM(J14:J27)","v":2377216.6298000002},{"$f":"SUM(K14:K27)","v":6585884.6924999999},{"$f":"SUM(L14:L27)","v":532703.81389999995},{"$f":"SUM(M14:M27)","v":1037839.029},{"$f":"SUM(N14:N27)","v":4967132.5790000008},{"$f":"SUM(O14:O27)","v":4515949.7396999998},{"$f":"SUM(P14:P27)","v":35199999.999700002}]
[null,"8101","Klinická hodnocení - I. Interní klinika",0,0,129639.2115,0,0,0,5744.6608999999999,0,0,0,226408.97270000001,0,{"$f":"SUM(D14:O14)","v":361792.84510000004}]
[null,"8103","Klinická hodnocení - III. Interní klinika",0,0,0,0,0,0,30283.304,0,0,0,21980.143700000001,0,{"$f":"SUM(D15:O15)","v":52263.447700000004}]
[null,"8108","Klinická hodnocení - Porodnicko-gynekologická klinika",0,0,0,0,0,0,0,17581.436099999999,0,0,0,0,17581.436099999999]
[null,"8112","Klinická hodnocení - Urologická klinika",0,27662.387999999999,0,0,0,0,15097.352699999999,0,0,0,0,0,42759.740699999995]
[null,"8114","Klinická hodnocení - Oční klinika",0,93049.482099999994,0,49657.914400000001,0,0,0,0,0,0,110076.2138,0,252783.6103]
[null,"8116","Klinická hodnocení - Klinika plicních nemocí a tuberkulózy",28262.333500000001,147491.52929999999,0,119281.0156,0,26378.739799999999,0,7621.5784000000003,281574.94069999998,1098.7629999999999,46721.133600000001,11684.6994,670114.73329999996]
[null,"8117","Klinická hodnocení - Neurologická klinika",17382.556499999999,0,25872.039100000002,84926.274799999999,11163.1741,199898.75810000001,46700.442000000003,0,0,11856.427299999999,9636.3261000000002,283711.17320000002,691147.17119999998]
[null,"8120","Klinická hodnocení - Klinika chorob kožních a pohlavních",0,0,0,0,93138.227299999999,0,0,0,0,56225.670899999997,300407.54350000003,0,449771.44170000002]
[null,"8121","Klinická hodnocení - Onkologická klinika",595677.34089999995,1483246.9515,1090108.2461999999,3307623.0200999998,487584.8443,786879.26760000002,2070674.2912999999,4175938.4796000002,21038.598000000002,532766.61439999996,1439158.0423999999,3568455.3939999999,19559151.090300001]
[null,"8127","Klinická hodnocení - Klinika TVL a kardiovask rehabilitace",0,0,0,0,0,0,0,0,0,0,47604.692600000002,0,47604.692600000002]
[null,"8132","Klinická hodnocení - Hemato-onkologická klinika",80433.282900000006,1488142.0558,2748247.9512,214623.86379999999,0,236146.943,4257.9892,1566035.9404,107772.181,332973.63760000002,2301436.8072000002,13184.870199999999,9093255.5223000012]
[null,"8148","Klinická hodnocení - Lékárna",100690.76850000001,281144.52559999999,253430.283,336404.1152,125419.7941,178805.5079,162723.16829999999,797778.43859999999,80460.455400000006,61060.277000000002,463702.7034,617984.78350000002,3459604.8205000004]
[null,"9028","Oddělení vědy a výzkumu",62786.458100000003,41857.638800000001,20928.8194,125572.9163,0,83715.277499999997,41735.421399999999,20928.8194,41857.638800000001,41857.638800000001,0,20928.8194,502169.44790000003]
[]
[]
[64924440,"Klinické hodnocení - EU (81xx,9003,9028)",null,{"$f":"SUM(D30:D42)","v":296067.94390000007},{"$f":"SUM(E30:E42)","v":446036.92949999997},{"$f":"SUM(F30:F42)","v":169885.65510000003},{"$f":"SUM(G30:G42)","v":1063846},{"$f":"SUM(H30:H42)","v":374526.66620000004},{"$f":"SUM(I30:I42)","v":1430224.9595999999},{"$f":"SUM(J30:J42)","v":450770.18079999997},{"$f":"SUM(K30:K42)","v":607293.23560000001},{"$f":"SUM(L30:L42)","v":260460.10639999999},{"$f":"SUM(M30:M42)","v":161126.2113},{"$f":"SUM(N30:N42)","v":163552.2702},{"$f":"SUM(O30:O42)","v":916209.84120000002},{"$f":"SUM(P30:P42)","v":6339999.9998000003}]
[null,"8101","Klinická hodnocení - I. Interní klinika",0,0,0,0,0,10196.123,0,0,64640.955999999998,0,0,0,{"$f":"SUM(D30:O30)","v":74837.078999999998}]
[null,"8103","Klinická hodnocení - III. Interní klinika",0,0,0,0,0,3652.3418000000001,0,0,0,0,0,0,{"$f":"SUM(D31:O31)","v":3652.3418000000001}]
[null,"8105","Klinická hodnocení - II. Chirurgická klinika",0,0,0,0,67407.0573,0,0,31044.475299999998,73532.786999999997,0,29959.614000000001,0,201943.93359999999]
[null,"8110","Klinická hodnocení - Dětská klinika",0,0,0,30025.017899999999,8609.2152000000006,0,0,18437.479800000001,0,0,76507.834199999998,11783.4548,145363.0019]
[null,"8112","Klinická hodnocení - Urologická klinika",0,0,0,2893.0127000000002,0,0,0,0,0,0,0,0,2893.0127000000002]
[null,"8114","Klinická hodnocení - Oční klinika",0,5621.8949000000002,0,0,0,0,0,0,67875.270999999993,34421.010900000001,0,0,107918.17679999999]
[null,"8116","Klinická hodnocení - Klinika plicních nemocí a tuberkulózy",0,0,0,0,22535.301800000001,6145.8266000000003,282622.31349999999,7458.95,0,0,26496.821800000002,72435.265299999999,417694.47899999993]
[null,"8117","Klinická hodnocení - Neurologická klinika",8813.6376999999993,0,0,0,0,0,0,0,0,0,0,0,8813.6376999999993]
[null,"8121","Klinická hodnocení - Onkologická klinika",314656.8077,182689.09580000001,0,692663.84340000001,193735.9241,1005060.8122,0,190813.60819999999,0,0,0,436159.16029999999,3015779.2517000004]
[null,"8132","Klinická hodnocení - Hemato-onkologická klinika",-137804.50169999999,9913.5686000000005,122249.62360000001,132866.29930000001,3317.0500999999999,86548.049799999993,109727.76,283290.53080000001,35289.698900000003,126454.4568,0,145040.73929999999,916893.27549999999]
[null,"8148","Klinická hodnocení - Lékárna",55089.560899999997,229374.8904,13249.4987,168714.35269999999,60466.735099999998,259520.3296,3247.0306999999998,57810.7117,450.69189999999998,250.74359999999999,12110.787700000001,195639.99340000001,1055925.3264000001]
[null,"9028","Oddělení vědy a výzkumu",55312.439299999998,18437.479800000001,34386.532800000001,36683.474000000002,18455.382600000001,59101.476600000002,55173.0766,18437.479800000001,18670.7016,0,18477.212500000001,55151.2281,388286.48370000004]
[]
[]
[64924441,"Klinické hodnocení - 3.země (81xx,9003,9028)",null,{"$f":"SUM(D45:D57)","v":309381.076},{"$f":"SUM(E45:E57)","v":457797.40390000003},{"$f":"SUM(F45:F57)","v":1030136.6881000001},{"$f":"SUM(G45:G57)","v":217622.83820000003},{"$f":"SUM(H45:H57)","v":578617.18279999995},{"$f":"SUM(I45:I57)","v":415146.34069999994},{"$f":"SUM(J45:J57)","v":1005090.3327},{"$f":"SUM(K45:K57)","v":613466.21070000005},{"$f":"SUM(L45:L57)","v":378758.93229999999},{"$f":"SUM(M45:M57)","v":185755.91619999998},{"$f":"SUM(N45:N57)","v":1035337.9598},{"$f":"SUM(O45:O57)","v":672889.11840000004},{"$f":"SUM(P45:P57)","v":6899999.9997999985}]
[null,"8101","Klinická hodnocení - I. Interní klinika",12693.0144,0,482382.5442,0,0,33026.716899999999,5390.8869999999997,0,11210.4902,0,0,21962.054199999999,{"$f":"SUM(D45:O45)","v":566665.70689999999}]
[null,"8103","Klinická hodnocení - III. Interní klinika",0,15368.420599999999,0,0,0,0,16382.0054,121680.6977,0,25808.062300000001,21382.8619,0,{"$f":"SUM(D46:O46)","v":200622.04789999998}]
[null,"8108","Klinická hodnocení - Porodnicko-gynekologická klinika",0,0,0,0,0,5583.7975999999999,0,0,0,0,0,0,5583.7975999999999]
[null,"8116","Klinická hodnocení - Klinika plicních nemocí a tuberkulózy",156967.21489999999,0,193645.52,0,0,0,0,0,291970.56150000001,0,0,169652.2286,812235.52500000002]
[null,"8117","Klinická hodnocení - Neurologická klinika",51911.6132,0,36560.696300000003,217114.73130000001,0,52952.197699999997,49899.183700000001,0,0,122810.8636,0,0,531249.28580000007]
[null,"8120","Klinická hodnocení - Klinika chorob kožních a pohlavních",0,0,0,0,102224.9005,0,0,0,0,0,0,0,102224.9005]
[null,"8121","Klinická hodnocení - Onkologická klinika",7058.0518000000002,371309.59570000001,7086.5681000000004,63.7791,393108.29029999999,43121.802499999998,401196.82120000001,455302.7193,0,13802.565500000001,463824.95529999997,0,2155875.1488000001]
[null,"8132","Klinická hodnocení - Hemato-onkologická klinika",0,30281.614300000001,219513.0385,444.32780000000002,0,156712.45989999999,387346.18050000002,19439.6469,0,0,434633.17009999999,328861.38559999998,1577231.8236]
[null,"8134","Klinická hodnocení - Radiologická klinika",0,0,0,0,0,63714.377399999998,0,0,0,0,0,0,63714.377399999998]
[null,"8148","Klinická hodnocení - Lékárna",19994.504000000001,19742.583600000002,23157.1047,0,26624.753799999999,17515.579900000001,96403.972099999999,17043.146799999999,26405.622899999998,2047.3804,94400.138699999996,131153.74559999999,474488.53249999997]
[null,"8150","Klinická hodnocení - Kardiochirurgická klinika",39496.973299999998,0,3933.4704999999999,0,0,0,27258.668600000001,0,6652.8489,0,0,0,77341.961299999995]
[null,"9028","Oddělení vědy a výzkumu",21259.704399999999,21095.189699999999,63857.745799999997,0,56659.2382,42519.408799999997,21212.6142,0,42519.408799999997,21287.044399999999,21096.8338,21259.704399999999,332766.89250000002]
[]
[]
[67101000,"Transfery MZ - ostatní",null,{"$f":"SUM(D60:D77)","v":0},{"$f":"SUM(E60:E77)","v":0},{"$f":"SUM(F60:F77)","v":0},{"$f":"SUM(G60:G77)","v":3438388.0527999997},{"$f":"SUM(H60:H77)","v":0},{"$f":"SUM(I60:I77)","v":0},{"$f":"SUM(J60:J77)","v":1171677.2598999999},{"$f":"SUM(K60:K77)","v":5433498.4347000001},{"$f":"SUM(L60:L77)","v":5472207.9249},{"$f":"SUM(M60:M77)","v":604224.27540000004},{"$f":"SUM(N60:N77)","v":8351.5115000000005},{"$f":"SUM(O60:O77)","v":832652.54080000008},{"$f":"SUM(P60:P77)","v":16961000}]
[null,"0873","IROP - Mod.obn.přístr.vyb.perinatologického centra",0,0,0,0,0,0,0,0,0,0,8351.5115000000005,0,{"$f":"SUM(D60:O60)","v":8351.5115000000005}]
[null,"1096","OPVaVI - NPU I (projekt ÚMTM)",0,0,0,363532.63819999999,22340.820299999999,0,0,0,0,0,0,0,{"$f":"SUM(D61:O61)","v":385873.45850000001}]
[null,"1704","OP VVV - Molekulární, buněčný a klinický přístup ke zdravému stárnutí",0,0,0,0,0,0,0,0,5472207.9249,0,0,2232328.9859000002,7704536.9108000007]
[null,"2103","Národní onkologický registr - NOR",0,0,0,0,0,0,0,1137379.9105,0,0,0,0,1137379.9105]
[null,"3203","HOK: OPŽP - Novostavba pavilonu HOK",0,0,0,0,0,0,0,6469.8348999999998,0,0,0,0,6469.8348999999998]
[null,"3396","OPVaVI - NPU I (projekt ÚMTM)",0,0,0,2160839.1675999998,3708.6916999999999,0,0,0,0,0,0,0,2164547.8592999997]
[null,"3503","TO - krizová připravenost",0,0,0,0,0,0,272080.00579999998,0,0,0,0,0,272080.00579999998]
[null,"4496","OPVaVI - NPU I (projekt ÚMTM)",0,0,0,914016.24699999997,-26049.511999999999,0,0,0,0,0,0,0,887966.73499999999]
[null,"5102","NTMC - Národní telemedicínské centrum - provoz",0,0,0,0,0,0,0,0,0,604224.27540000004,0,0,604224.27540000004]
[null,"5106","NTMC: SHAPES",0,0,0,0,0,0,0,0,0,0,0,51769.683199999999,51769.683199999999]
[null,"9029","Paliativní péče",0,0,0,0,0,0,0,4029007.1197000002,0,0,0,-1397640.9227,2631366.1970000002]
[null,"9151","MA FNOL: Běh za zdraví",0,0,0,0,0,0,0,131804.87539999999,0,0,0,0,131804.87539999999]
[null,"9801","Krizová připravenost - MZ",0,0,0,0,0,0,899597.25410000002,0,0,0,0,-53805.205600000001,845792.04850000003]
[null,"9819","TranMZČR: Bezpečnost a kvalita zdravotní péče",0,0,0,0,0,0,0,128836.6942,0,0,0,0,128836.6942]
[]
[]
[]
[]
[]
[67101001,"Transfery MZ na VaV - věcné náklady",null,{"$f":"SUM(D80:D91)","v":0},{"$f":"SUM(E80:E91)","v":0},{"$f":"SUM(F80:F91)","v":0},{"$f":"SUM(G80:G91)","v":707431.17660000001},{"$f":"SUM(H80:H91)","v":0},{"$f":"SUM(I80:I91)","v":1053286.4185000001},{"$f":"SUM(J80:J91)","v":1856788.4957000001},{"$f":"SUM(K80:K91)","v":0},{"$f":"SUM(L80:L91)","v":0},{"$f":"SUM(M80:M91)","v":-366816.16570000001},{"$f":"SUM(N80:N91)","v":0},{"$f":"SUM(O80:O91)","v":-421689.9252},{"$f":"SUM(P80:P91)","v":2828999.9999000002}]
[null,"8508","Prof. MUDr. Miloš Táborský, CSc., FESC, MBA - I.IK",0,0,0,0,0,0,478607.75900000002,0,0,-366816.16570000001,0,0,{"$f":"SUM(D80:O80)","v":111791.59330000001}]
[null,"8509","Doc. MUDr. Daniel Šaňák, PhD. - NEUROL",0,0,0,0,0,0,974682.95449999999,0,0,0,0,-159077.74299999999,{"$f":"SUM(D81:O81)","v":815605.21149999998}]
[null,"8510","Doc. MUDr. Petr Hamal, PhD. - MIKRO",0,0,0,0,0,0,403497.78220000002,0,0,0,0,-12653.3586,390844.42360000004]
[null,"8511","Prof. MUDr. Radovan Pilka, PhD. - PORGYN",0,0,0,707431.17660000001,0,0,0,0,0,0,0,-89781.348299999998,617649.82830000005]
[null,"8512","Grant: MUDr. Martin Loveček, PhD. - I. CHIR",0,0,0,0,0,164193.90270000001,0,0,0,0,0,-18985.705999999998,145208.1967]
[null,"8513","Grant: MUDr. Martin Šín, PhD., FEBO - OČNÍ",0,0,0,0,0,534503.55570000003,0,0,0,0,0,-134360.90119999999,400142.65450000006]
[null,"8514","Grant: Doc. MUDr. Miroslav Vaverka, CSc. - NEUROCH",0,0,0,0,0,354588.96010000003,0,0,0,0,0,-6830.8680999999997,347758.092]
[]
[]
[]
[]
[]
[]
[67101002,"Transfery MZ na VaV - mzdové náklady",null,{"$f":"SUM(D94:D104)","v":0},{"$f":"SUM(E94:E104)","v":0},{"$f":"SUM(F94:F104)","v":0},{"$f":"SUM(G94:G104)","v":829784.2513},{"$f":"SUM(H94:H104)","v":0},{"$f":"SUM(I94:I104)","v":956969.97090000007},{"$f":"SUM(J94:J104)","v":2232929.9320999999},{"$f":"SUM(K94:K104)","v":0},{"$f":"SUM(L94:L104)","v":0},{"$f":"SUM(M94:M104)","v":0},{"$f":"SUM(N94:N104)","v":0},{"$f":"SUM(O94:O104)","v":-145684.15429999999},{"$f":"SUM(P94:P104)","v":3874000}]
[null,"8508","Prof. MUDr. Miloš Táborský, CSc., FESC, MBA - I.IK",0,0,0,0,0,0,349760.72889999999,0,0,0,0,-1215.8032000000001,{"$f":"SUM(D94:O94)","v":348544.92569999996}]
[null,"8509","Doc. MUDr. Daniel Šaňák, PhD. - NEUROL",0,0,0,0,0,0,1276985.6525000001,0,0,0,0,-84258.928899999999,{"$f":"SUM(D95:O95)","v":1192726.7236000001}]
[null,"8510","Doc. MUDr. Petr Hamal, PhD. - MIKRO",0,0,0,0,0,0,606183.55070000002,0,0,0,0,-675.32539999999995,605508.22530000005]
[null,"8511","Prof. MUDr. Radovan Pilka, PhD. - PORGYN",0,0,0,829784.2513,0,0,0,0,0,0,0,-48543.148000000001,781241.10329999996]
[null,"8512","Grant: MUDr. Martin Loveček, PhD. - I. CHIR",0,0,0,0,0,342580.88990000001,0,0,0,0,0,-2160.3519999999999,340420.5379]
[null,"8513","Grant: MUDr. Martin Šín, PhD., FEBO - OČNÍ",0,0,0,0,0,419507.73639999999,0,0,0,0,0,0,419507.73639999999]
[null,"8514","Grant: Doc. MUDr. Miroslav Vaverka, CSc. - NEUROCH",0,0,0,0,0,194881.34460000001,0,0,0,0,0,-8830.5967999999993,186050.74780000001]
[]
[]
[]
[]
[]
[67101006,"Transfery MZ na rezidenční místa",null,{"$f":"SUM(D107:D132)","v":0},{"$f":"SUM(E107:E132)","v":0},{"$f":"SUM(F107:F132)","v":0},{"$f":"SUM(G107:G132)","v":0},{"$f":"SUM(H107:H132)","v":63293.899899999997},{"$f":"SUM(I107:I132)","v":1979545.7943000002},{"$f":"SUM(J107:J132)","v":0},{"$f":"SUM(K107:K132)","v":1504875.0338000001},{"$f":"SUM(L107:L132)","v":0},{"$f":"SUM(M107:M132)","v":3547714.7280000006},{"$f":"SUM(N107:N132)","v":153926.8677},{"$f":"SUM(O107:O132)","v":901643.67630000005},{"$f":"SUM(P107:P132)","v":8150999.9999999991}]
[null,"0184","1IK: rezidenti 2019 - nelékařské obory",0,0,0,0,0,0,0,0,0,0,12177.7585,-2800.8845000000001,{"$f":"SUM(D107:O107)","v":9376.8739999999998}]
[null,"0185","Rezidenti 2018 - nelékařské obory",0,0,0,0,0,0,0,205804.11900000001,0,205804.11900000001,0,-8755.8083999999999,{"$f":"SUM(D108:O108)","v":402852.42960000003}]
[null,"0188","Rezidenti 2017 - nelékařské obory",0,0,0,0,0,101074.178,0,0,0,101074.178,0,-5967.1017000000002,196181.2543]
[null,"0286","Rezidenti 2018 - lékaři",0,0,0,0,0,571136.87470000004,0,0,0,571136.87470000004,0,0,1142273.7494000001]
[null,"0386","3IK: Rezidenti 2019 - lékaři",0,0,0,0,0,0,0,0,0,0,0,170488.61929999999,170488.61929999999]
[null,"0685","Rezidenti 2018",0,0,0,0,0,0,0,122264.69560000001,0,122264.69560000001,0,0,244529.39120000001]
[null,"0688","Rezidenti 2017 - nelékařské obory",0,0,0,0,0,16318.196400000001,0,0,0,16318.196400000001,0,0,32636.392800000001]
[null,"0785","Rezidenti 2018",0,0,0,0,0,0,0,250472.1373,0,250472.1373,0,-706.31,500237.96460000001]
[null,"0788","Rezidenti 2017 - nelékařské obory",0,0,0,0,0,16318.196400000001,0,0,0,16318.196400000001,0,0,32636.392800000001]
[null,"0885","Rezidenti 2018",0,0,0,0,0,0,0,122264.69560000001,0,122264.69560000001,0,0,244529.39120000001]
[null,"0886","Rezidenti 2018",0,0,0,0,0,571136.87470000004,0,0,0,571136.87470000004,0,0,1142273.7494000001]
[null,"0988","Rezidenti 2017 - nelékařské obory",0,0,0,0,0,56191.831100000003,0,0,0,56191.831100000003,0,0,112383.66220000001]
[null,"1083","Rezidenti 2016 - ošetřovatelská a intenzivní péče",0,0,0,0,63293.899899999997,0,0,0,0,63293.899899999997,0,0,126587.79979999999]
[null,"1086","DK: Rezidenti 2019 - lékaři",0,0,0,0,0,0,0,0,0,0,0,664788.70880000002,664788.70880000002]
[null,"1185","Rezidenti 2018",0,0,0,0,0,0,0,143453.99540000001,0,143453.99540000001,42378.599699999999,-718.48779999999999,328568.10270000005]
[null,"1188","Rezidenti 2017 - nelékařské obory",0,0,0,0,0,0,0,0,0,0,75014.992499999993,-733.10109999999997,74281.891399999993]
[null,"1388","Rezidenti 2017 - nelékařské obory",0,0,0,0,0,59914.571900000003,0,0,0,59914.571900000003,0,0,119829.14380000001]
[null,"1685","Rezidenti 2018",0,0,0,0,0,0,0,256414.88339999999,0,256414.88339999999,0,-706.31,512123.45679999999]
[null,"1686","PLIC: rezidenti 2019 - lékaři",0,0,0,0,0,0,0,0,0,0,0,166197.17720000001,166197.17720000001]
[null,"1886","Rezidenti 2018",0,0,0,0,0,571136.87470000004,0,0,0,571136.87470000004,0,0,1142273.7494000001]
[null,"3285","Rezidenti 2018",0,0,0,0,0,0,0,187513.1257,0,187513.1257,0,-50350.160400000001,324676.09100000001]
[null,"3485","Rezidenti 2018",0,0,0,0,0,0,0,94422.686199999996,0,94422.686199999996,0,-24355.517,164489.8554]
[null,"5085","Rezidenti 2018",0,0,0,0,0,0,0,122264.69560000001,0,122264.69560000001,0,-353.15499999999997,244176.23620000001]
[null,"5684",null,0,0,0,0,0,0,0,0,0,0,24355.517,-4383.9930999999997,19971.5239]
[null,"6088","Rezidenti 2017 - nelékařské obory",0,0,0,0,0,16318.196400000001,0,0,0,16318.196400000001,0,0,32636.392800000001]
[]
[]
[67101010,"Transfery MZ - RIV (institucionální podpora)",null,{"$f":"SUM(D135:D163)","v":0},{"$f":"SUM(E135:E163)","v":0},{"$f":"SUM(F135:F163)","v":0},{"$f":"SUM(G135:G163)","v":8408942.5221999995},{"$f":"SUM(H135:H163)","v":0},{"$f":"SUM(I135:I163)","v":0},{"$f":"SUM(J135:J163)","v":0},{"$f":"SUM(K135:K163)","v":0},{"$f":"SUM(L135:L163)","v":0},{"$f":"SUM(M135:M163)","v":0},{"$f":"SUM(N135:N163)","v":0},{"$f":"SUM(O135:O163)","v":-408942.52210000012},{"$f":"SUM(P135:P163)","v":8000000.0001000008}]
[null,"8711","RIV: doc. Mgr. Jan Bouchal, PhD.",0,0,0,289763.69819999998,0,0,0,0,0,0,0,0,{"$f":"SUM(D135:O135)","v":289763.69819999998}]
[null,"8712","RIV: prof. MUDr. Jiří Gallo, PhD.",0,0,0,289763.69819999998,0,0,0,0,0,0,0,-35634.316700000003,{"$f":"SUM(D136:O136)","v":254129.38149999999}]
[null,"8713","RIV: MUDr. Matěj Halaj",0,0,0,289763.69819999998,0,0,0,0,0,0,0,-6261.5153,283502.18289999996]
[null,"8715","RIV: MUDr. Karel Huml",0,0,0,434645.54729999998,0,0,0,0,0,0,0,-29128.9594,405516.58789999998]
[null,"8716","RIV: MUDr. Beáta Hutyrová, PhD.",0,0,0,289763.69819999998,0,0,0,0,0,34771.643799999998,0,-62045.362099999998,262489.97990000003]
[null,"8719","RIV: MUDr. Hana Klosová, PhD.",0,0,0,197039.31479999999,0,0,0,0,0,0,0,-30571.2988,166468.016]
[null,"8720","RIV: MUDr. Petr Kolář, PhD.",0,0,0,289763.69819999998,0,0,0,0,0,0,0,-9231.3150999999998,280532.38309999998]
[null,"8721","RIV: MUDr. Andrea Smržová",0,0,0,289763.69819999998,0,0,0,0,0,0,0,-4007.2581,285756.44010000001]
[null,"8724","RIV: MUDr. Vladimír Študent, PhD.",0,0,0,223697.57500000001,0,0,0,0,0,0,0,-32572.569100000001,191125.00590000002]
[null,"8725","RIV: MUDr. Helena Urbánková",0,0,0,289763.69819999998,0,0,0,0,0,0,0,-40605.607000000004,249158.09119999997]
[null,"8726","RIV: Mgr. Petr Vrtěl",0,0,0,231810.95860000001,0,0,0,0,0,0,0,0,231810.95860000001]
[null,"8753","RIV: MUDr. Richard Salzmann, Ph.D.",0,0,0,347716.43790000002,0,0,0,0,0,0,0,-1594.8594000000001,346121.5785]
[null,"8760","RIV: RNDr. Martin Novák, Ph.D.",0,0,0,243401.50649999999,0,0,0,0,0,0,0,-36412.343800000002,206989.16269999999]
[null,"8762","RIV - Doc. MUDr. David Karásek, Ph. D.",0,0,0,347716.43790000002,0,0,0,0,0,0,0,-11885.353499999999,335831.08439999999]
[null,"8777","RIV: Prof. MUDr. Radovan Pilka, Ph.D.",0,0,0,289763.69819999998,0,0,0,0,0,0,0,-8056.5550999999996,281707.14309999999]
[null,"8780","RIV - MUDr. Eva Karásková",0,0,0,347716.43790000002,0,0,0,0,0,0,0,-1685.4743000000001,346030.96360000002]
[null,"8782","RIV - RNDr. Pavlína Čapková, Ph. D.",0,0,0,289763.69819999998,0,0,0,0,0,0,0,0,289763.69819999998]
[null,"8785","RIV - Doc. MUDr. Martin Hutyra, Ph. D.",0,0,0,347716.43790000002,0,0,0,0,0,0,0,-74911.855500000005,272804.58240000001]
[null,"8789","RIV - Doc. MUDr. Kateřina Menšíková, Ph. D. - MEX",0,0,0,695432.87569999998,0,0,0,0,0,0,0,-7245.4254000000001,688187.45030000003]
[null,"8791","RIV - Doc. Mgr. Luděk Slavík, Ph. D. - MEX",0,0,0,718613.97160000005,0,0,0,0,0,0,0,-1572.1303,717041.84130000009]
[null,"8792","RIV - Prof. MUDr. Jiří Gallo, Ph. D. - MEX",0,0,0,695432.87569999998,0,0,0,0,0,0,0,-2299.5994999999998,693133.27619999996]
[null,"8793","RIV: prof. MUDr. Milan Raška, PhD. - MEX",0,0,0,657184.0675,0,0,0,0,0,-34771.643799999998,0,-44.148400000000002,622368.2753000001]
[null,"8794","RIV: MUDr. Martin Loveček, PhD. - MEX",0,0,0,312944.7941,0,0,0,0,0,0,0,-13176.5753,299768.21879999997]
[]
[]
[]
[]
[]
[]
[]
[67101011,"Transfery MZ - MEDEVAC (humanitární program)",null,{"$f":"SUM(D166:D168)","v":0},{"$f":"SUM(E166:E168)","v":0},{"$f":"SUM(F166:F168)","v":0},{"$f":"SUM(G166:G168)","v":0},{"$f":"SUM(H166:H168)","v":0},{"$f":"SUM(I166:I168)","v":0},{"$f":"SUM(J166:J168)","v":0},{"$f":"SUM(K166:K168)","v":0},{"$f":"SUM(L166:L168)","v":0},{"$f":"SUM(M166:M168)","v":0},{"$f":"SUM(N166:N168)","v":286063.72529999999},{"$f":"SUM(O166:O168)","v":116936.27469999999},{"$f":"SUM(P166:P168)","v":403000}]
[null,"9813","MEDEVAC",0,0,0,0,0,0,0,0,0,0,286063.72529999999,116936.27469999999,{"$f":"SUM(D166:O166)","v":403000}]
[]
[]
[]
[67102001,"Transfery jiného poskytovatele - VaV věcné",null,{"$f":"SUM(D171:D204)","v":265602.53450000001},{"$f":"SUM(E171:E204)","v":0},{"$f":"SUM(F171:F204)","v":0},{"$f":"SUM(G171:G204)","v":375634.22330000001},{"$f":"SUM(H171:H204)","v":513456.85189999995},{"$f":"SUM(I171:I204)","v":675601.12089999998},{"$f":"SUM(J171:J204)","v":306047.30780000001},{"$f":"SUM(K171:K204)","v":3255721.8015999994},{"$f":"SUM(L171:L204)","v":0},{"$f":"SUM(M171:M204)","v":0},{"$f":"SUM(N171:N204)","v":0},{"$f":"SUM(O171:O204)","v":-661063.83990000002},{"$f":"SUM(P171:P204)","v":4731000.0000999998}]
[null,"8542","Prof. MUDr. Jiří Ehrmann, Ph.D. - PATOL",0,0,0,0,0,0,0,94584.156900000002,0,0,0,-37145.400900000001,{"$f":"SUM(D171:O171)","v":57438.756000000001}]
[null,"8544","MUDr. Jana Volejníková, Ph.D. - DK",0,0,0,0,0,0,0,257404.02710000001,0,0,0,-29152.1613,{"$f":"SUM(D172:O172)","v":228251.8658}]
[null,"8551","Doc. MUDr. Vladimír Študent, PhD. - UROL",0,0,0,0,0,0,0,152010.25219999999,0,0,0,-35619.4139,116390.83829999999]
[null,"8552","Doc. MUDr. Jiří Minařík, PhD. - HOK",0,0,0,0,0,0,0,31077.651600000001,0,0,0,0,31077.651600000001]
[null,"8553","MUDr. Hana Študentová, Ph.D. - ONKO",0,0,0,0,0,0,96610.960300000006,0,0,0,0,-1362.1267,95248.833600000013]
[null,"8555","Doc. RNDr. Radek Vrtěl, PhD. - GENETIKA",0,0,0,0,0,0,0,272267.25170000002,0,0,0,-1377.4426000000001,270889.80910000001]
[null,"8556","MUDr. Tomáš Veverka, PhD. - NEUROL",29868.386399999999,0,0,0,0,0,0,239162.79680000001,0,0,0,-14224.1263,254807.05690000003]
[null,"8557","MUDr. Petr Šantavý, PhD. - KARDIOCHIR",0,0,0,0,0,0,0,287130.47639999999,0,0,0,-192.41120000000001,286938.06520000001]
[null,"8558","MUDr. Filip Čtvrtlík, PhD. - RTG",0,0,0,0,0,0,0,224299.57209999999,0,0,0,-38519.674899999998,185779.89720000001]
[null,"8559","MUDr. JUDr. Dušan Klos, Ph.D. - I.CHIR",0,0,0,0,0,0,0,351988.18400000001,0,0,0,-1072.5708,350915.61320000002]
[null,"8560","Mgr. Lenka Kocourková - LEM",0,0,0,0,0,0,0,217543.56090000001,0,0,0,-641.44949999999994,216902.11140000002]
[null,"8561","MUDr. Ondřej Krystyník - III. IK",0,0,0,0,0,0,0,485757.2059,0,0,0,-15968.0622,469789.14370000002]
[null,"8562","Mgr. Taťána Štosová, Ph.D. - MIKRO",0,0,0,0,0,0,0,133769.02189999999,0,0,0,-19020.461800000001,114748.56009999999]
[null,"8563","Doc. MUDr. Jan Minařík, Ph.D. - HOK",0,0,0,0,0,0,0,210111.9486,0,0,0,-1649.6963000000001,208462.25229999999]
[null,"8564","MUDr. Jan Přeček, Ph.D. - I.IK",0,0,0,41211.668400000002,0,0,0,0,0,0,0,0,41211.668400000002]
[null,"8565","Prof. MUDr. Ing. Petr Hluštík, Ph.D. - NEUROL",79805.1054,0,0,0,177007.49369999999,0,0,0,0,0,0,-105413.624,151398.97509999998]
[null,"8566","MUDr. Michaela Kaiserová - NEUROL",0,0,0,0,88503.746799999994,0,0,0,0,0,0,-23757.371500000001,64746.375299999992]
[null,"8567","MUDr. Jana Petřková, Ph.D. - I.IK",0,0,0,0,0,120932.60060000001,0,0,0,0,0,-821.34860000000003,120111.25200000001]
[null,"8568","Prof. MUDr. Dagmar Pospíšilová, Ph.D. - DK",6633.4503999999997,0,0,0,0,70262.516600000003,0,0,0,0,0,-23592.477599999998,53303.489400000006]
[null,"8569","MUDr. Přemysl Falt, Ph.D. - II.IK",0,0,0,0,247945.61139999999,0,0,0,0,0,0,0,247945.61139999999]
[null,"8570","Prof. MUDr. Bohuslav Melichar, Ph.D. - ONKO",126075.9587,0,0,0,0,0,196599.92619999999,0,0,0,0,-207979.26500000001,114696.61989999999]
[null,"8571","MUDr. Tomáš Skála, Ph.D., FESC - I.IK",23219.633600000001,0,0,334422.55489999999,0,0,0,0,0,0,0,-22123.335599999999,335518.8529]
[null,"8572","Grant: Doc. MUDr. Petr Šantavý, Ph.D. - KARDIOCHIR",0,0,0,0,0,291184.08309999999,0,0,0,0,0,-0.40539999999999998,291183.6777]
[null,"8573","Grant: MUDr. Jan Přeček, PhD. - I.IK",0,0,0,0,0,0,12836.4213,0,0,0,0,0,12836.4213]
[null,"8574","Grant: Doc. MUDr. Kateřina Menšíková, PhD. - NEURO",0,0,0,0,0,193221.92060000001,0,0,0,0,0,-3663.0686999999998,189558.85190000001]
[null,"8575","Grant: Doc. MUDr. Miroslav Vaverka, CSc. - NEUROCH",0,0,0,0,0,0,0,41211.668400000002,0,0,0,-18916.831399999999,22294.837000000003]
[null,"8576","Grant: MUDr. Vladislav Raclavský, PhD. - MIKRO",0,0,0,0,0,0,0,67560.112099999998,0,0,0,-0.94579999999999997,67559.166299999997]
[null,"8577","Grant: Prof. MUDr. Bohuslav Melichar, Ph.D. - ONKO",0,0,0,0,0,0,0,35806.859400000001,0,0,0,0,35806.859400000001]
[null,"8578","Grant: Prof. MUDr. Mgr. Milan Raška, PhD. - IMUNO",0,0,0,0,0,0,0,67560.112099999998,0,0,0,-31753.5635,35806.548599999995]
[null,"8579","Grant: Prof. MUDr. Dagmar Pospíšilová, PhD. - DK",0,0,0,0,0,0,0,86476.943499999994,0,0,0,-27096.6044,59380.339099999997]
[]
[]
[]
[]
[]
[67102002,"Transfery jiného poskytovatele - VaV mzdové",null,{"$f":"SUM(D207:D240)","v":29850.614099999999},{"$f":"SUM(E207:E240)","v":0},{"$f":"SUM(F207:F240)","v":0},{"$f":"SUM(G207:G240)","v":470093.76949999999},{"$f":"SUM(H207:H240)","v":1081057.3892000001},{"$f":"SUM(I207:I240)","v":924359.46600000001},{"$f":"SUM(J207:J240)","v":747085.04779999994},{"$f":"SUM(K207:K240)","v":5809694.2122},{"$f":"SUM(L207:L240)","v":0},{"$f":"SUM(M207:M240)","v":0},{"$f":"SUM(N207:N240)","v":0},{"$f":"SUM(O207:O240)","v":-152140.49850000002},{"$f":"SUM(P207:P240)","v":8910000.0002999995}]
[null,"8542","Prof. MUDr. Jiří Ehrmann, Ph.D. - PATOL",0,0,0,0,0,0,0,263537.41619999998,0,0,0,-9852.01,{"$f":"SUM(D207:O207)","v":253685.40619999997}]
[null,"8544","MUDr. Jana Volejníková, Ph.D. - DK",0,0,0,0,0,0,0,204973.546,0,0,0,-26868.153999999999,{"$f":"SUM(D208:O208)","v":178105.39199999999}]
[null,"8551","Doc. MUDr. Vladimír Študent, PhD. - UROL",0,0,0,0,0,0,0,337929.35960000003,0,0,0,-1.6857,337927.67390000005]
[null,"8552","Doc. MUDr. Jiří Minařík, PhD. - HOK",0,0,0,0,0,0,0,195476.70209999999,0,0,0,0,195476.70209999999]
[null,"8553","MUDr. Hana Študentová, Ph.D. - ONKO",0,0,0,0,0,0,432106.39419999998,0,0,0,0,-5104.9493000000002,427001.4449]
[null,"8555","Doc. RNDr. Radek Vrtěl, PhD. - GENETIKA",0,0,0,0,0,0,0,477216.40240000002,0,0,0,0,477216.40240000002]
[null,"8556","MUDr. Tomáš Veverka, PhD. - NEUROL",0,0,0,0,0,0,0,565062.20779999997,0,0,0,-25021.1603,540041.04749999999]
[null,"8557","MUDr. Petr Šantavý, PhD. - KARDIOCHIR",0,0,0,0,0,0,0,356923.04719999997,0,0,0,-3168.3528999999999,353754.69429999997]
[null,"8558","MUDr. Filip Čtvrtlík, PhD. - RTG",0,0,0,0,0,0,0,642619.76569999999,0,0,0,0,642619.76569999999]
[null,"8559","MUDr. JUDr. Dušan Klos, Ph.D. - I.CHIR",0,0,0,0,0,0,0,619669.05980000005,0,0,0,-11815.205400000001,607853.85440000007]
[null,"8560","Mgr. Lenka Kocourková - LEM",0,0,0,0,0,0,0,208139.1606,0,0,0,-5392.9964,202746.1642]
[null,"8561","MUDr. Ondřej Krystyník - III. IK",0,0,0,0,0,0,0,349800.4143,0,0,0,-254.4521,349545.96220000001]
[null,"8562","Mgr. Taťána Štosová, Ph.D. - MIKRO",0,0,0,0,0,0,0,121876.16250000001,0,0,0,-346.8485,121529.31400000001]
[null,"8563","Doc. MUDr. Jan Minařík, Ph.D. - HOK",0,0,0,0,0,0,0,235046.8848,0,0,0,-580.84280000000001,234466.04199999999]
[null,"8564","MUDr. Jan Přeček, Ph.D. - I.IK",0,0,0,243752.32490000001,0,0,0,0,0,0,0,-15470.4377,228281.8872]
[null,"8565","Prof. MUDr. Ing. Petr Hluštík, Ph.D. - NEUROL",0,0,0,0,424983.76130000001,0,0,0,0,0,0,-413.52420000000001,424570.23710000003]
[null,"8566","MUDr. Michaela Kaiserová - NEUROL",0,0,0,0,401241.65179999999,0,0,0,0,0,0,-69.105400000000003,401172.54639999999]
[null,"8567","MUDr. Jana Petřková, Ph.D. - I.IK",0,0,0,0,0,269077.24180000002,0,0,0,0,0,-5029.4255999999996,264047.8162]
[null,"8568","Prof. MUDr. Dagmar Pospíšilová, Ph.D. - DK",0,0,0,0,0,150366.69399999999,0,0,0,0,0,-937.68669999999997,149429.0073]
[null,"8569","MUDr. Přemysl Falt, Ph.D. - II.IK",0,0,0,0,254831.9761,0,0,0,0,0,0,0,254831.9761]
[null,"8570","Prof. MUDr. Bohuslav Melichar, Ph.D. - ONKO",29850.614099999999,0,0,0,0,0,202599.33499999999,0,0,0,0,-24319.960899999998,208129.98819999999]
[null,"8571","MUDr. Tomáš Skála, Ph.D., FESC - I.IK",0,0,0,226341.44459999999,0,0,0,0,0,0,0,-1683.6321,224657.8125]
[null,"8572","Grant: Doc. MUDr. Petr Šantavý, Ph.D. - KARDIOCHIR",0,0,0,0,0,140869.85010000001,0,0,0,0,0,-2759.8856999999998,138109.9644]
[null,"8573","Grant: MUDr. Jan Přeček, PhD. - I.IK",0,0,0,0,0,0,112379.3186,0,0,0,0,-246.26900000000001,112133.0496]
[null,"8574","Grant: Doc. MUDr. Kateřina Menšíková, PhD. - NEURO",0,0,0,0,0,364045.6801,0,0,0,0,0,-636.51800000000003,363409.16210000002]
[null,"8575","Grant: Doc. MUDr. Miroslav Vaverka, CSc. - NEUROCH",0,0,0,0,0,0,0,150366.69399999999,0,0,0,-6813.5185000000001,143553.17549999998]
[null,"8576","Grant: MUDr. Vladislav Raclavský, PhD. - MIKRO",0,0,0,0,0,0,0,407572.88099999999,0,0,0,-1172.4091000000001,406400.4719]
[null,"8577","Grant: Prof. MUDr. Bohuslav Melichar, Ph.D. - ONKO",0,0,0,0,0,0,0,239795.30669999999,0,0,0,-819.41139999999996,238975.89529999997]
[null,"8578","Grant: Prof. MUDr. Mgr. Milan Raška, PhD. - IMUNO",0,0,0,0,0,0,0,244543.7286,0,0,0,-2254.4715999999999,242289.25700000001]
[null,"8579","Grant: Prof. MUDr. Dagmar Pospíšilová, PhD. - DK",0,0,0,0,0,0,0,189145.47289999999,0,0,0,-1107.5852,188037.88769999999]
[]
[]
[]
[]
[]
[67102004,"Transfery jiného poskytovatele - ostatní",null,{"$f":"SUM(D243:D247)","v":700416.66669999994},{"$f":"SUM(E243:E247)","v":700416.66669999994},{"$f":"SUM(F243:F247)","v":700416.66669999994},{"$f":"SUM(G243:G247)","v":700416.66669999994},{"$f":"SUM(H243:H247)","v":700416.66669999994},{"$f":"SUM(I243:I247)","v":700416.66669999994},{"$f":"SUM(J243:J247)","v":700416.66669999994},{"$f":"SUM(K243:K247)","v":700416.66669999994},{"$f":"SUM(L243:L247)","v":700416.66669999994},{"$f":"SUM(M243:M247)","v":700416.66669999994},{"$f":"SUM(N243:N247)","v":700416.66669999994},{"$f":"SUM(O243:O247)","v":700416.66669999994},{"$f":"SUM(P243:P247)","v":8405000.0003999993}]
[null,"5106","NTMC: SHAPES",363666.6667,363666.6667,363666.6667,363666.6667,363666.6667,363666.6667,363666.6667,363666.6667,363666.6667,363666.6667,363666.6667,363666.6667,{"$f":"SUM(D243:O243)","v":4364000.0004000003}]
[null,"5107","NTMC: PROFID",67083.333299999998,67083.333299999998,67083.333299999998,67083.333299999998,67083.333299999998,67083.333299999998,67083.333299999998,67083.333299999998,67083.333299999998,67083.333299999998,67083.333299999998,67083.333299999998,{"$f":"SUM(D244:O244)","v":804999.99960000021}]
[null,"5108","NTMC: Projekt niCE-life",172500,172500,172500,172500,172500,172500,172500,172500,172500,172500,172500,172500,2070000]
[null,"5110","NTMC: Projekt X",97166.666700000002,97166.666700000002,97166.666700000002,97166.666700000002,97166.666700000002,97166.666700000002,97166.666700000002,97166.666700000002,97166.666700000002,97166.666700000002,97166.666700000002,97166.666700000002,1166000.0003999998]

{"sheet":"2_Upravený","index":3,"n_rows":247,"n_cols":21,"rows_kept":247,"cut":false,"hidden":true,"merged":[[0,16,1,16]]}
["Legenda",null,"Hodnoty v CZK",null,null,null,null,null,null,null,null,null,null,null,null,null,"Rozdíl"]
["Účet","Název účtu"]
[null,"NS","Název NS",{"$f":"MID(Summary!$B$2,18,4)&\"01\"","v":"202101"},{"$f":"MID(Summary!$B$2,18,4)&\"02\"","v":"202102"},{"$f":"MID(Summary!$B$2,18,4)&\"03\"","v":"202103"},{"$f":"MID(Summary!$B$2,18,4)&\"04\"","v":"202104"},{"$f":"MID(Summary!$B$2,18,4)&\"05\"","v":"202105"},{"$f":"MID(Summary!$B$2,18,4)&\"06\"","v":"202106"},{"$f":"MID(Summary!$B$2,18,4)&\"07\"","v":"202107"},{"$f":"MID(Summary!$B$2,18,4)&\"08\"","v":"202108"},{"$f":"MID(Summary!$B$2,18,4)&\"09\"","v":"202109"},{"$f":"MID(Summary!$B$2,18,4)&\"10\"","v":"202110"},{"$f":"MID(Summary!$B$2,18,4)&\"11\"","v":"202111"},{"$f":"MID(Summary!$B$2,18,4)&\"12\"","v":"202112"},{"$f":"MID(Summary!$B$2,18,4)&\" celkem\"","v":"2021 celkem"},{"$f":"SUM(Q4:Q8)","v":0}]
[]
[64908009,"Smlouva o účelově vázané úplatě",null,{"$f":"SUM(D6:D7)","v":0},0,0,75568.2788,0,33948.849300000002,0,0,0,33356.640299999999,0,72126.231599999999,215000,{"$f":"ROUND(P5-SUMIF('1_Původní'!A:A,'2_Upravený'!A5,'1_Původní'!P:P),0)","v":0}]
[null,"4803","OP - specializační vzdělávání klinických farmaceutů",0,0,0,75568.2788,0,33948.849300000002,0,0,0,33356.640299999999,0,72126.231599999999,{"$f":"SUM(D6:O6)","v":215000},{"$f":"IF(AND(ROUND(P6,0)<>0,B6=\"\"),\"Obrat bez specifikace NS\",\"\")","v":""},null,"Orig",{"$f":"$A$5","v":64908009}]
[null,"",{"$f":"IFERROR(VLOOKUP(B7,CisNS!$A:$B,2,FALSE),\"\")","v":""},null,null,null,null,null,null,null,null,null,null,null,null,{"$f":"SUM(D7:O7)","v":0},{"$f":"IF(AND(ROUND(P7,0)<>0,B7=\"\"),\"Obrat bez specifikace NS\",\"\")","v":""},null,null,{"$f":"T6","v":64908009},"End"]
[]
[64924438,"Výkony etické komise",null,{"$f":"SUM(D10:D11)","v":132976.4454},{"$f":"SUM(E10:E11)","v":167451.82010000001},{"$f":"SUM(F10:F11)","v":201927.1949},{"$f":"SUM(G10:G11)","v":211777.30189999999},{"$f":"SUM(H10:H11)","v":226552.46249999999},{"$f":"SUM(I10:I11)","v":132976.4454},{"$f":"SUM(J10:J11)","v":216702.35550000001},{"$f":"SUM(K10:K11)","v":197002.14129999999},{"$f":"SUM(L10:L11)","v":128051.3919},{"$f":"SUM(M10:M11)","v":221627.40900000001},{"$f":"SUM(N10:N11)","v":251177.73019999999},{"$f":"SUM(O10:O11)","v":211777.30189999999},{"$f":"SUM(P10:P11)","v":2300000},{"$f":"ROUND(P9-SUMIF('1_Původní'!A:A,'2_Upravený'!A9,'1_Původní'!P:P),0)","v":0}]
[null,"9003","Etická komise",132976.4454,167451.82010000001,201927.1949,211777.30189999999,226552.46249999999,132976.4454,216702.35550000001,197002.14129999999,128051.3919,221627.40900000001,251177.73019999999,211777.30189999999,{"$f":"SUM(D10:O10)","v":2300000},{"$f":"IF(AND(ROUND(P10,0)<>0,B10=\"\"),\"Obrat bez specifikace NS\",\"\")","v":""},null,"Orig",{"$f":"$A$5","v":64908009}]
[null,"",{"$f":"IFERROR(VLOOKUP(B11,CisNS!$A:$B,2,FALSE),\"\")","v":""},null,null,null,null,null,null,null,null,null,null,null,null,0,"",null,null,{"$f":"T10","v":64908009},"End"]
[]
[64924439,"Klinické hodnocení - tuzemci (81xx,9003,9028)",null,{"$f":"SUM(D14:D27)","v":885232.74040000001},{"$f":"SUM(E14:E27)","v":3562594.5710999998},{"$f":"SUM(F14:F27)","v":4268226.5504000001},{"$f":"SUM(G14:G27)","v":4238089.1201999998},{"$f":"SUM(H14:H27)","v":717306.03979999991},{"$f":"SUM(I14:I27)","v":1511824.4939000001},{"$f":"SUM(J14:J27)","v":2377216.6298000002},{"$f":"SUM(K14:K27)","v":6585884.6924999999},{"$f":"SUM(L14:L27)","v":532703.81389999995},{"$f":"SUM(M14:M27)","v":1037839.029},{"$f":"SUM(N14:N27)","v":4967132.5790000008},{"$f":"SUM(O14:O27)","v":4515949.7396999998},{"$f":"SUM(P14:P27)","v":35199999.999700002},{"$f":"ROUND(P13-SUMIF('1_Původní'!A:A,'2_Upravený'!A13,'1_Původní'!P:P),0)","v":0}]
[null,"8101","Klinická hodnocení - I. Interní klinika",0,0,129639.2115,0,0,0,5744.6608999999999,0,0,0,226408.97270000001,0,{"$f":"SUM(D14:O14)","v":361792.84510000004},{"$f":"IF(AND(ROUND(P14,0)<>0,B14=\"\"),\"Obrat bez specifikace NS\",\"\")","v":""},null,"Orig",{"$f":"$A$13","v":64924439}]
[null,"8103","Klinická hodnocení - III. Interní klinika",0,0,0,0,0,0,30283.304,0,0,0,21980.143700000001,0,{"$f":"SUM(D15:O15)","v":52263.447700000004},{"$f":"IF(AND(ROUND(P15,0)<>0,B15=\"\"),\"Obrat bez specifikace NS\",\"\")","v":""},null,"Orig",{"$f":"$A$13","v":64924439}]
[null,"8108","Klinická hodnocení - Porodnicko-gynekologická klinika",0,0,0,0,0,0,0,17581.436099999999,0,0,0,0,17581.436099999999,"",null,"Orig",64924439]
[null,"8112","Klinická hodnocení - Urologická klinika",0,27662.387999999999,0,0,0,0,15097.352699999999,0,0,0,0,0,42759.740699999995,"",null,"Orig",64924439]
[null,"8114","Klinická hodnocení - Oční klinika",0,93049.482099999994,0,49657.914400000001,0,0,0,0,0,0,110076.2138,0,252783.6103,"",null,"Orig",64924439]
[null,"8116","Klinická hodnocení - Klinika plicních nemocí a tuberkulózy",28262.333500000001,147491.52929999999,0,119281.0156,0,26378.739799999999,0,7621.5784000000003,281574.94069999998,1098.7629999999999,46721.133600000001,11684.6994,670114.73329999996,"",null,"Orig",64924439]
[null,"8117","Klinická hodnocení - Neurologická klinika",17382.556499999999,0,25872.039100000002,84926.274799999999,11163.1741,199898.75810000001,46700.442000000003,0,0,11856.427299999999,9636.3261000000002,283711.17320000002,691147.17119999998,"",null,"Orig",64924439]
[null,"8120","Klinická hodnocení - Klinika chorob kožních a pohlavních",0,0,0,0,93138.227299999999,0,0,0,0,56225.670899999997,300407.54350000003,0,449771.44170000002,"",null,"Orig",64924439]
[null,"8121","Klinická hodnocení - Onkologická klinika",595677.34089999995,1483246.9515,1090108.2461999999,3307623.0200999998,487584.8443,786879.26760000002,2070674.2912999999,4175938.4796000002,21038.598000000002,532766.61439999996,1439158.0423999999,3568455.3939999999,19559151.090300001,"",null,"Orig",64924439]
[null,"8127","Klinická hodnocení - Klinika TVL a kardiovask rehabilitace",0,0,0,0,0,0,0,0,0,0,47604.692600000002,0,47604.692600000002,"",null,"Orig",64924439]
[null,"8132","Klinická hodnocení - Hemato-onkologická klinika",80433.282900000006,1488142.0558,2748247.9512,214623.86379999999,0,236146.943,4257.9892,1566035.9404,107772.181,332973.63760000002,2301436.8072000002,13184.870199999999,9093255.5223000012,"",null,"Orig",64924439]
[null,"8148","Klinická hodnocení - Lékárna",100690.76850000001,281144.52559999999,253430.283,336404.1152,125419.7941,178805.5079,162723.16829999999,797778.43859999999,80460.455400000006,61060.277000000002,463702.7034,617984.78350000002,3459604.8205000004,"",null,"Orig",64924439]
[null,"9028","Oddělení vědy a výzkumu",62786.458100000003,41857.638800000001,20928.8194,125572.9163,0,83715.277499999997,41735.421399999999,20928.8194,41857.638800000001,41857.638800000001,0,20928.8194,502169.44790000003,"",null,"Orig",64924439]
[null,"",{"$f":"IFERROR(VLOOKUP(B27,CisNS!$A:$B,2,FALSE),\"\")","v":""},null,null,null,null,null,null,null,null,null,null,null,null,0,"",null,null,{"$f":"T14","v":64924439},"End"]
[]
[64924440,"Klinické hodnocení - EU (81xx,9003,9028)",null,{"$f":"SUM(D30:D42)","v":459477.44559999998},{"$f":"SUM(E30:E42)","v":446036.92949999997},{"$f":"SUM(F30:F42)","v":169885.65510000003},{"$f":"SUM(G30:G42)","v":1063846},{"$f":"SUM(H30:H42)","v":374526.66620000004},{"$f":"SUM(I30:I42)","v":1430224.9595999999},{"$f":"SUM(J30:J42)","v":450770.18079999997},{"$f":"SUM(K30:K42)","v":443883.70479999995},{"$f":"SUM(L30:L42)","v":260460.10639999999},{"$f":"SUM(M30:M42)","v":161126.2113},{"$f":"SUM(N30:N42)","v":163552.2702},{"$f":"SUM(O30:O42)","v":916209.84120000002},{"$f":"SUM(P30:P42)","v":6339999.9707000013},{"$f":"ROUND(P29-SUMIF('1_Původní'!A:A,'2_Upravený'!A29,'1_Původní'!P:P),0)","v":0}]
[null,"8101","Klinická hodnocení - I. Interní klinika",0,0,0,0,0,10196.123,0,0,64640.955999999998,0,0,0,{"$f":"SUM(D30:O30)","v":74837.078999999998},{"$f":"IF(AND(ROUND(P30,0)<>0,B30=\"\"),\"Obrat bez specifikace NS\",\"\")","v":""},null,"Orig",{"$f":"$A$29","v":64924440}]
[null,"8103","Klinická hodnocení - III. Interní klinika",0,0,0,0,0,3652.3418000000001,0,0,0,0,0,0,{"$f":"SUM(D31:O31)","v":3652.3418000000001},{"$f":"IF(AND(ROUND(P31,0)<>0,B31=\"\"),\"Obrat bez specifikace NS\",\"\")","v":""},null,"Orig",{"$f":"$A$29","v":64924440}]
[null,"8105","Klinická hodnocení - II. Chirurgická klinika",0,0,0,0,67407.0573,0,0,31044.475299999998,73532.786999999997,0,29959.614000000001,0,201943.93359999999,"",null,"Orig",64924440]
[null,"8110","Klinická hodnocení - Dětská klinika",0,0,0,30025.017899999999,8609.2152000000006,0,0,18437.479800000001,0,0,76507.834199999998,11783.4548,145363.0019,"",null,"Orig",64924440]
[null,"8112","Klinická hodnocení - Urologická klinika",0,0,0,2893.0127000000002,0,0,0,0,0,0,0,0,2893.0127000000002,"",null,"Orig",64924440]
[null,"8114","Klinická hodnocení - Oční klinika",0,5621.8949000000002,0,0,0,0,0,0,67875.270999999993,34421.010900000001,0,0,107918.17679999999,"",null,"Orig",64924440]
[null,"8116","Klinická hodnocení - Klinika plicních nemocí a tuberkulózy",0,0,0,0,22535.301800000001,6145.8266000000003,282622.31349999999,7458.95,0,0,26496.821800000002,72435.265299999999,417694.47899999993,"",null,"Orig",64924440]
[null,"8117","Klinická hodnocení - Neurologická klinika",8813.6376999999993,0,0,0,0,0,0,0,0,0,0,0,8813.6376999999993,"",null,"Orig",64924440]
[null,"8121","Klinická hodnocení - Onkologická klinika",314656.8077,182689.09580000001,0,692663.84340000001,193735.9241,1005060.8122,0,190813.60819999999,0,0,0,436159.16029999999,3015779.2517000004,"",null,"Orig",64924440]
[null,"8132","Klinická hodnocení - Hemato-onkologická klinika",25605,9913.5686000000005,122249.62360000001,132866.29930000001,3317.0500999999999,86548.049799999993,109727.76,119881,35289.698900000003,126454.4568,0,145040.73929999999,916893.24640000006,"",null,"Orig",64924440]
[null,"8148","Klinická hodnocení - Lékárna",55089.560899999997,229374.8904,13249.4987,168714.35269999999,60466.735099999998,259520.3296,3247.0306999999998,57810.7117,450.69189999999998,250.74359999999999,12110.787700000001,195639.99340000001,1055925.3264000001,"",null,"Orig",64924440]
[null,"9028","Oddělení vědy a výzkumu",55312.439299999998,18437.479800000001,34386.532800000001,36683.474000000002,18455.382600000001,59101.476600000002,55173.0766,18437.479800000001,18670.7016,0,18477.212500000001,55151.2281,388286.48370000004,"",null,"Orig",64924440]
[null,"",{"$f":"IFERROR(VLOOKUP(B42,CisNS!$A:$B,2,FALSE),\"\")","v":""},null,null,null,null,null,null,null,null,null,null,null,null,0,"",null,null,{"$f":"T30","v":64924440},"End"]
[]
[64924441,"Klinické hodnocení - 3.země (81xx,9003,9028)",null,{"$f":"SUM(D45:D57)","v":309381.076},{"$f":"SUM(E45:E57)","v":457797.40390000003},{"$f":"SUM(F45:F57)","v":1030136.6881000001},{"$f":"SUM(G45:G57)","v":217622.83820000003},{"$f":"SUM(H45:H57)","v":578617.18279999995},{"$f":"SUM(I45:I57)","v":415146.34069999994},{"$f":"SUM(J45:J57)","v":1005090.3327},{"$f":"SUM(K45:K57)","v":613466.21070000005},{"$f":"SUM(L45:L57)","v":378758.93229999999},{"$f":"SUM(M45:M57)","v":185755.91619999998},{"$f":"SUM(N45:N57)","v":1035337.9598},{"$f":"SUM(O45:O57)","v":672889.11840000004},{"$f":"SUM(P45:P57)","v":6899999.9997999985},{"$f":"ROUND(P44-SUMIF('1_Původní'!A:A,'2_Upravený'!A44,'1_Původní'!P:P),0)","v":0}]
[null,"8101","Klinická hodnocení - I. Interní klinika",12693.0144,0,482382.5442,0,0,33026.716899999999,5390.8869999999997,0,11210.4902,0,0,21962.054199999999,{"$f":"SUM(D45:O45)","v":566665.70689999999},{"$f":"IF(AND(ROUND(P45,0)<>0,B45=\"\"),\"Obrat bez specifikace NS\",\"\")","v":""},null,"Orig",{"$f":"$A$44","v":64924441}]
[null,"8103","Klinická hodnocení - III. Interní klinika",0,15368.420599999999,0,0,0,0,16382.0054,121680.6977,0,25808.062300000001,21382.8619,0,{"$f":"SUM(D46:O46)","v":200622.04789999998},{"$f":"IF(AND(ROUND(P46,0)<>0,B46=\"\"),\"Obrat bez specifikace NS\",\"\")","v":""},null,"Orig",{"$f":"$A$44","v":64924441}]
[null,"8108","Klinická hodnocení - Porodnicko-gynekologická klinika",0,0,0,0,0,5583.7975999999999,0,0,0,0,0,0,5583.7975999999999,"",null,"Orig",64924441]
[null,"8116","Klinická hodnocení - Klinika plicních nemocí a tuberkulózy",156967.21489999999,0,193645.52,0,0,0,0,0,291970.56150000001,0,0,169652.2286,812235.52500000002,"",null,"Orig",64924441]
[null,"8117","Klinická hodnocení - Neurologická klinika",51911.6132,0,36560.696300000003,217114.73130000001,0,52952.197699999997,49899.183700000001,0,0,122810.8636,0,0,531249.28580000007,"",null,"Orig",64924441]
[null,"8120","Klinická hodnocení - Klinika chorob kožních a pohlavních",0,0,0,0,102224.9005,0,0,0,0,0,0,0,102224.9005,"",null,"Orig",64924441]
[null,"8121","Klinická hodnocení - Onkologická klinika",7058.0518000000002,371309.59570000001,7086.5681000000004,63.7791,393108.29029999999,43121.802499999998,401196.82120000001,455302.7193,0,13802.565500000001,463824.95529999997,0,2155875.1488000001,"",null,"Orig",64924441]
[null,"8132","Klinická hodnocení - Hemato-onkologická klinika",0,30281.614300000001,219513.0385,444.32780000000002,0,156712.45989999999,387346.18050000002,19439.6469,0,0,434633.17009999999,328861.38559999998,1577231.8236,"",null,"Orig",64924441]
[null,"8134","Klinická hodnocení - Radiologická klinika",0,0,0,0,0,63714.377399999998,0,0,0,0,0,0,63714.377399999998,"",null,"Orig",64924441]
[null,"8148","Klinická hodnocení - Lékárna",19994.504000000001,19742.583600000002,23157.1047,0,26624.753799999999,17515.579900000001,96403.972099999999,17043.146799999999,26405.622899999998,2047.3804,94400.138699999996,131153.74559999999,474488.53249999997,"",null,"Orig",64924441]
[null,"8150","Klinická hodnocení - Kardiochirurgická klinika",39496.973299999998,0,3933.4704999999999,0,0,0,27258.668600000001,0,6652.8489,0,0,0,77341.961299999995,"",null,"Orig",64924441]
[null,"9028","Oddělení vědy a výzkumu",21259.704399999999,21095.189699999999,63857.745799999997,0,56659.2382,42519.408799999997,21212.6142,0,42519.408799999997,21287.044399999999,21096.8338,21259.704399999999,332766.89250000002,"",null,"Orig",64924441]
[null,"",{"$f":"IFERROR(VLOOKUP(B57,CisNS!$A:$B,2,FALSE),\"\")","v":""},null,null,null,null,null,null,null,null,null,null,null,null,0,"",null,null,{"$f":"T45","v":64924441},"End"]
[]
[67101000,"Transfery MZ - ostatní",null,{"$f":"SUM(D60:D77)","v":1524833.3333333333},{"$f":"SUM(E60:E77)","v":1524833.3333333333},{"$f":"SUM(F60:F77)","v":1289833.3333333333},{"$f":"SUM(G60:G77)","v":1289833.3333333333},{"$f":"SUM(H60:H77)","v":1289833.3333333333},{"$f":"SUM(I60:I77)","v":1289833.3333333333},{"$f":"SUM(J60:J77)","v":1767833.3333333333},{"$f":"SUM(K60:K77)","v":1824833.3333333333},{"$f":"SUM(L60:L77)","v":1289833.3333333333},{"$f":"SUM(M60:M77)","v":1289833.3333333333},{"$f":"SUM(N60:N77)","v":1289833.3333333333},{"$f":"SUM(O60:O77)","v":1289833.3333333333},{"$f":"SUM(P60:P77)","v":16961000},{"$f":"ROUND(P59-SUMIF('1_Původní'!A:A,'2_Upravený'!A59,'1_Původní'!P:P),0)","v":0}]
[null,"0873","IROP - Mod.obn.přístr.vyb.perinatologického centra",0,0,0,0,0,0,0,0,0,0,0,0,{"$f":"SUM(D60:O60)","v":0},{"$f":"IF(AND(ROUND(P60,0)<>0,B60=\"\"),\"Obrat bez specifikace NS\",\"\")","v":""},null,"Orig",{"$f":"$A$59","v":67101000}]
[null,"1096","OPVaVI - NPU I (projekt ÚMTM)",0,0,0,0,0,0,0,0,0,0,0,0,{"$f":"SUM(D61:O61)","v":0},{"$f":"IF(AND(ROUND(P61,0)<>0,B61=\"\"),\"Obrat bez specifikace NS\",\"\")","v":""},null,"Orig",{"$f":"$A$59","v":67101000}]
[null,"1704","OP VVV - Molekulární, buněčný a klinický přístup ke zdravému stárnutí",1210000,1210000,1210000,1210000,1210000,1210000,1210000,1210000,1210000,1210000,1210000,1210000,14520000,"",null,"Orig",67101000]
[null,"2103","Národní onkologický registr - NOR",0,0,0,0,0,0,0,535000,0,0,0,0,535000,"",null,"Orig",67101000]
[null,"3203","HOK: OPŽP - Novostavba pavilonu HOK",0,0,0,0,0,0,0,0,0,0,0,0,0,"",null,"Orig",67101000]
[null,"3396","OPVaVI - NPU I (projekt ÚMTM)",0,0,0,0,0,0,0,0,0,0,0,0,0,"",null,"Orig",67101000]
[null,"3503","TO - krizová připravenost",0,0,0,0,0,0,130000,0,0,0,0,0,130000,"",null,"Orig",67101000]
[null,"4496","OPVaVI - NPU I (projekt ÚMTM)",0,0,0,0,0,0,0,0,0,0,0,0,0,"",null,"Orig",67101000]
[null,"5102","NTMC - Národní telemedicínské centrum - provoz",0,0,0,0,0,0,0,0,0,0,0,0,0,"",null,"Orig",67101000]
[null,"5106","NTMC: SHAPES",0,0,0,0,0,0,0,0,0,0,0,0,0,"",null,"Orig",67101000]
[null,"9029","Paliativní péče",235000,235000,0,0,0,0,0,0,0,0,0,0,470000,"",null,"Orig",67101000]
[null,"9151","MA FNOL: Běh za zdraví",0,0,0,0,0,0,0,0,0,0,0,0,0,"",null,"Orig",67101000]
[null,"9801","Krizová připravenost - MZ",0,0,0,0,0,0,348000,0,0,0,0,0,348000,"",null,"Orig",67101000]
[null,"9819","TranMZČR: Bezpečnost a kvalita zdravotní péče",0,0,0,0,0,0,0,0,0,0,0,0,0,"",null,"Orig",67101000]
[null,"5110",{"$f":"IFERROR(VLOOKUP(B74,CisNS!$A:$B,2,FALSE),\"\")","v":"NTMC: Projekt X"},79833.333333333328,79833.333333333328,79833.333333333328,79833.333333333328,79833.333333333328,79833.333333333328,79833.333333333328,79833.333333333328,79833.333333333328,79833.333333333328,79833.333333333328,79833.333333333328,{"$f":"SUM(D74:O74)","v":958000.00000000012},{"$f":"IF(AND(ROUND(P74,0)<>0,B74=\"\"),\"Obrat bez specifikace NS\",\"\")","v":""},null,null,67101000]
[null,"",{"$f":"IFERROR(VLOOKUP(B75,CisNS!$A:$B,2,FALSE),\"\")","v":""},0,0,0,0,0,0,0,0,0,0,0,0,{"$f":"SUM(D75:O75)","v":0},{"$f":"IF(AND(ROUND(P75,0)<>0,B75=\"\"),\"Obrat bez specifikace NS\",\"\")","v":""},null,null,67101000]
[null,"",{"$f":"IFERROR(VLOOKUP(B76,CisNS!$A:$B,2,FALSE),\"\")","v":""},null,null,null,null,null,null,null,null,null,null,null,null,{"$f":"SUM(D76:O76)","v":0},{"$f":"IF(AND(ROUND(P76,0)<>0,B76=\"\"),\"Obrat bez specifikace NS\",\"\")","v":""},null,null,67101000]
[null,"",{"$f":"IFERROR(VLOOKUP(B77,CisNS!$A:$B,2,FALSE),\"\")","v":""},null,null,null,null,null,null,null,null,null,null,null,null,0,"",null,null,{"$f":"T60","v":67101000},"End"]
[]
[67101001,"Transfery MZ na VaV - věcné náklady",null,{"$f":"SUM(D80:D91)","v":0},{"$f":"SUM(E80:E91)","v":1071000},{"$f":"SUM(F80:F91)","v":0},{"$f":"SUM(G80:G91)","v":0},{"$f":"SUM(H80:H91)","v":1078000},{"$f":"SUM(I80:I91)","v":680000},{"$f":"SUM(J80:J91)","v":0},{"$f":"SUM(K80:K91)","v":0},{"$f":"SUM(L80:L91)","v":0},{"$f":"SUM(M80:M91)","v":0},{"$f":"SUM(N80:N91)","v":0},{"$f":"SUM(O80:O91)","v":0},{"$f":"SUM(P80:P91)","v":2829000},{"$f":"ROUND(P79-SUMIF('1_Původní'!A:A,'2_Upravený'!A79,'1_Původní'!P:P),0)","v":0}]
[null,"8508","Prof. MUDr. Miloš Táborský, CSc., FESC, MBA - I.IK",0,0,0,0,0,0,0,0,0,0,0,0,{"$f":"SUM(D80:O80)","v":0},{"$f":"IF(AND(ROUND(P80,0)<>0,B80=\"\"),\"Obrat bez specifikace NS\",\"\")","v":""},null,"Orig",{"$f":"$A$79","v":67101001}]
[null,"8509","Doc. MUDr. Daniel Šaňák, PhD. - NEUROL",0,0,0,0,0,0,0,",",0,0,0,0,{"$f":"SUM(D81:O81)","v":0},{"$f":"IF(AND(ROUND(P81,0)<>0,B81=\"\"),\"Obrat bez specifikace NS\",\"\")","v":""},null,"Orig",{"$f":"$A$79","v":67101001}]
[null,"8510","Doc. MUDr. Petr Hamal, PhD. - MIKRO",0,0,0,0,0,0,0,0,0,0,0,0,0,"",null,"Orig",67101001]
[null,"8511","Prof. MUDr. Radovan Pilka, PhD. - PORGYN",0,0,0,0,0,405000,0,0,0,0,0,0,405000,"",null,"Orig",67101001]
[null,"8512","Grant: MUDr. Martin Loveček, PhD. - I. CHIR",0,0,0,0,213000,0,0,0,0,0,0,0,213000,"",null,"Orig",67101001]
[null,"8513","Grant: MUDr. Martin Šín, PhD., FEBO - OČNÍ",0,0,0,0,354000,0,0,0,0,0,0,0,354000,"",null,"Orig",67101001]
[null,"8514","Grant: Doc. MUDr. Miroslav Vaverka, CSc. - NEUROCH",0,0,0,0,0,275000,0,0,0,0,0,0,275000,"",null,"Orig",67101001]
[null,"8515",{"$f":"IFERROR(VLOOKUP(B87,CisNS!$A:$B,2,FALSE),\"\")","v":"Grant: Doc. Dr. Ing. Eva Kriegová - IMUNO"},0,0,0,0,300000,0,0,0,0,0,0,0,{"$f":"SUM(D87:O87)","v":300000},{"$f":"IF(AND(ROUND(P87,0)<>0,B87=\"\"),\"Obrat bez specifikace NS\",\"\")","v":""},null,null,67101001]
[null,"8516",{"$f":"IFERROR(VLOOKUP(B88,CisNS!$A:$B,2,FALSE),\"\")","v":"Grant: Prof. RNDr. Tomáš Adam, PhD. - OKB"},0,0,0,0,211000,0,0,0,0,0,0,0,{"$f":"SUM(D88:O88)","v":211000},{"$f":"IF(AND(ROUND(P88,0)<>0,B88=\"\"),\"Obrat bez specifikace NS\",\"\")","v":""},null,null,67101001]
[null,"8517",{"$f":"IFERROR(VLOOKUP(B89,CisNS!$A:$B,2,FALSE),\"\")","v":"Grant: Ing. David Kula, PhD., MBA - I.IK"},0,1071000,0,0,0,0,0,0,0,0,0,0,{"$f":"SUM(D89:O89)","v":1071000},{"$f":"IF(AND(ROUND(P89,0)<>0,B89=\"\"),\"Obrat bez specifikace NS\",\"\")","v":""},null,null,67101001]
[null,"",{"$f":"IFERROR(VLOOKUP(B90,CisNS!$A:$B,2,FALSE),\"\")","v":""},null,null,null,null,null,null,null,null,null,null,null,null,{"$f":"SUM(D90:O90)","v":0},{"$f":"IF(AND(ROUND(P90,0)<>0,B90=\"\"),\"Obrat bez specifikace NS\",\"\")","v":""},null,null,67101001]
[null,null,{"$f":"IFERROR(VLOOKUP(B91,CisNS!$A:$B,2,FALSE),\"\")","v":""},null,null,null,null,null,null,null,null,null,null,null,null,0,"",null,null,{"$f":"T80","v":67101001},"End"]
[]
[67101002,"Transfery MZ na VaV - mzdové náklady",null,{"$f":"SUM(D94:D104)","v":0},{"$f":"SUM(E94:E104)","v":0},{"$f":"SUM(F94:F104)","v":558000},{"$f":"SUM(G94:G104)","v":0},{"$f":"SUM(H94:H104)","v":2221000},{"$f":"SUM(I94:I104)","v":1095000},{"$f":"SUM(J94:J104)","v":0},{"$f":"SUM(K94:K104)","v":0},{"$f":"SUM(L94:L104)","v":0},{"$f":"SUM(M94:M104)","v":0},{"$f":"SUM(N94:N104)","v":0},{"$f":"SUM(O94:O104)","v":0},{"$f":"SUM(P94:P104)","v":3874000},{"$f":"ROUND(P93-SUMIF('1_Původní'!A:A,'2_Upravený'!A93,'1_Původní'!P:P),0)","v":0}]
[null,"8508","Prof. MUDr. Miloš Táborský, CSc., FESC, MBA - I.IK",0,0,0,0,0,0,0,0,0,0,0,0,{"$f":"SUM(D94:O94)","v":0},{"$f":"IF(AND(ROUND(P94,0)<>0,B94=\"\"),\"Obrat bez specifikace NS\",\"\")","v":""},null,"Orig",{"$f":"$A$93","v":67101002}]
[null,"8509","Doc. MUDr. Daniel Šaňák, PhD. - NEUROL",0,0,0,0,0,0,0,0,0,0,0,0,{"$f":"SUM(D95:O95)","v":0},{"$f":"IF(AND(ROUND(P95,0)<>0,B95=\"\"),\"Obrat bez specifikace NS\",\"\")","v":""},null,"Orig",{"$f":"$A$93","v":67101002}]
[null,"8510","Doc. MUDr. Petr Hamal, PhD. - MIKRO",0,0,0,0,0,0,0,0,0,0,0,0,0,"",null,"Orig",67101002]
[null,"8511","Prof. MUDr. Radovan Pilka, PhD. - PORGYN",0,0,0,0,0,809000,0,0,0,0,0,0,809000,"",null,"Orig",67101002]
[null,"8512","Grant: MUDr. Martin Loveček, PhD. - I. CHIR",0,0,0,0,502000,0,0,0,0,0,0,0,502000,"",null,"Orig",67101002]
[null,"8513","Grant: MUDr. Martin Šín, PhD., FEBO - OČNÍ",0,0,0,0,616000,0,0,0,0,0,0,0,616000,"",null,"Orig",67101002]
[null,"8514","Grant: Doc. MUDr. Miroslav Vaverka, CSc. - NEUROCH",0,0,0,0,0,286000,0,0,0,0,0,0,286000,"",null,"Orig",67101002]
[null,"8515",{"$f":"IFERROR(VLOOKUP(B101,CisNS!$A:$B,2,FALSE),\"\")","v":"Grant: Doc. Dr. Ing. Eva Kriegová - IMUNO"},null,0,0,0,620000,0,0,0,0,0,0,0,{"$f":"SUM(D101:O101)","v":620000},{"$f":"IF(AND(ROUND(P101,0)<>0,B101=\"\"),\"Obrat bez specifikace NS\",\"\")","v":""},null,null,67101002]
[null,"8516",{"$f":"IFERROR(VLOOKUP(B102,CisNS!$A:$B,2,FALSE),\"\")","v":"Grant: Prof. RNDr. Tomáš Adam, PhD. - OKB"},null,0,0,0,483000,0,0,0,0,0,0,0,{"$f":"SUM(D102:O102)","v":483000},{"$f":"IF(AND(ROUND(P102,0)<>0,B102=\"\"),\"Obrat bez specifikace NS\",\"\")","v":""},null,null,67101002]
[null,"8517",{"$f":"IFERROR(VLOOKUP(B103,CisNS!$A:$B,2,FALSE),\"\")","v":"Grant: Ing. David Kula, PhD., MBA - I.IK"},null,0,558000,0,0,0,0,0,0,0,0,0,{"$f":"SUM(D103:O103)","v":558000},{"$f":"IF(AND(ROUND(P103,0)<>0,B103=\"\"),\"Obrat bez specifikace NS\",\"\")","v":""},null,null,67101002]
[null,"",{"$f":"IFERROR(VLOOKUP(B104,CisNS!$A:$B,2,FALSE),\"\")","v":""},null,null,null,null,null,null,null,null,null,null,null,null,0,"",null,null,{"$f":"T94","v":67101002},"End"]
[]
[67101006,"Transfery MZ na rezidenční místa",null,{"$f":"SUM(D107:D132)","v":0},{"$f":"SUM(E107:E132)","v":0},{"$f":"SUM(F107:F132)","v":0},{"$f":"SUM(G107:G132)","v":0},{"$f":"SUM(H107:H132)","v":63293.899899999997},{"$f":"SUM(I107:I132)","v":1979545.7943000002},{"$f":"SUM(J107:J132)","v":0},{"$f":"SUM(K107:K132)","v":1504875.0338000001},{"$f":"SUM(L107:L132)","v":0},{"$f":"SUM(M107:M132)","v":3547714.7280000006},{"$f":"SUM(N107:N132)","v":153926.8677},{"$f":"SUM(O107:O132)","v":901643.67630000005},{"$f":"SUM(P107:P132)","v":8150999.9999999991},{"$f":"ROUND(P106-SUMIF('1_Původní'!A:A,'2_Upravený'!A106,'1_Původní'!P:P),0)","v":0}]
[null,"0184","1IK: rezidenti 2019 - nelékařské obory",0,0,0,0,0,0,0,0,0,0,12177.7585,-2800.8845000000001,{"$f":"SUM(D107:O107)","v":9376.8739999999998},{"$f":"IF(AND(ROUND(P107,0)<>0,B107=\"\"),\"Obrat bez specifikace NS\",\"\")","v":""},null,"Orig",{"$f":"$A$106","v":67101006}]
[null,"0185","Rezidenti 2018 - nelékařské obory",0,0,0,0,0,0,0,205804.11900000001,0,205804.11900000001,0,-8755.8083999999999,{"$f":"SUM(D108:O108)","v":402852.42960000003},{"$f":"IF(AND(ROUND(P108,0)<>0,B108=\"\"),\"Obrat bez specifikace NS\",\"\")","v":""},null,"Orig",{"$f":"$A$106","v":67101006}]
[null,"0188","Rezidenti 2017 - nelékařské obory",0,0,0,0,0,101074.178,0,0,0,101074.178,0,-5967.1017000000002,196181.2543,"",null,"Orig",67101006]
[null,"0286","Rezidenti 2018 - lékaři",0,0,0,0,0,571136.87470000004,0,0,0,571136.87470000004,0,0,1142273.7494000001,"",null,"Orig",67101006]
[null,"0386","3IK: Rezidenti 2019 - lékaři",0,0,0,0,0,0,0,0,0,0,0,170488.61929999999,170488.61929999999,"",null,"Orig",67101006]
[null,"0685","Rezidenti 2018",0,0,0,0,0,0,0,122264.69560000001,0,122264.69560000001,0,0,244529.39120000001,"",null,"Orig",67101006]
[null,"0688","Rezidenti 2017 - nelékařské obory",0,0,0,0,0,16318.196400000001,0,0,0,16318.196400000001,0,0,32636.392800000001,"",null,"Orig",67101006]
[null,"0785","Rezidenti 2018",0,0,0,0,0,0,0,250472.1373,0,250472.1373,0,-706.31,500237.96460000001,"",null,"Orig",67101006]
[null,"0788","Rezidenti 2017 - nelékařské obory",0,0,0,0,0,16318.196400000001,0,0,0,16318.196400000001,0,0,32636.392800000001,"",null,"Orig",67101006]
[null,"0885","Rezidenti 2018",0,0,0,0,0,0,0,122264.69560000001,0,122264.69560000001,0,0,244529.39120000001,"",null,"Orig",67101006]
[null,"0886","Rezidenti 2018",0,0,0,0,0,571136.87470000004,0,0,0,571136.87470000004,0,0,1142273.7494000001,"",null,"Orig",67101006]
[null,"0988","Rezidenti 2017 - nelékařské obory",0,0,0,0,0,56191.831100000003,0,0,0,56191.831100000003,0,0,112383.66220000001,"",null,"Orig",67101006]
[null,"1083","Rezidenti 2016 - ošetřovatelská a intenzivní péče",0,0,0,0,63293.899899999997,0,0,0,0,63293.899899999997,0,0,126587.79979999999,"",null,"Orig",67101006]
[null,"1086","DK: Rezidenti 2019 - lékaři",0,0,0,0,0,0,0,0,0,0,0,664788.70880000002,664788.70880000002,"",null,"Orig",67101006]
[null,"1185","Rezidenti 2018",0,0,0,0,0,0,0,143453.99540000001,0,143453.99540000001,42378.599699999999,-718.48779999999999,328568.10270000005,"",null,"Orig",67101006]
[null,"1188","Rezidenti 2017 - nelékařské obory",0,0,0,0,0,0,0,0,0,0,75014.992499999993,-733.10109999999997,74281.891399999993,"",null,"Orig",67101006]
[null,"1388","Rezidenti 2017 - nelékařské obory",0,0,0,0,0,59914.571900000003,0,0,0,59914.571900000003,0,0,119829.14380000001,"",null,"Orig",67101006]
[null,"1685","Rezidenti 2018",0,0,0,0,0,0,0,256414.88339999999,0,256414.88339999999,0,-706.31,512123.45679999999,"",null,"Orig",67101006]
[null,"1686","PLIC: rezidenti 2019 - lékaři",0,0,0,0,0,0,0,0,0,0,0,166197.17720000001,166197.17720000001,"",null,"Orig",67101006]
[null,"1886","Rezidenti 2018",0,0,0,0,0,571136.87470000004,0,0,0,571136.87470000004,0,0,1142273.7494000001,"",null,"Orig",67101006]
[null,"3285","Rezidenti 2018",0,0,0,0,0,0,0,187513.1257,0,187513.1257,0,-50350.160400000001,324676.09100000001,"",null,"Orig",67101006]
[null,"3485","Rezidenti 2018",0,0,0,0,0,0,0,94422.686199999996,0,94422.686199999996,0,-24355.517,164489.8554,"",null,"Orig",67101006]
[null,"5085","Rezidenti 2018",0,0,0,0,0,0,0,122264.69560000001,0,122264.69560000001,0,-353.15499999999997,244176.23620000001,"",null,"Orig",67101006]
[null,"5684",null,0,0,0,0,0,0,0,0,0,0,24355.517,-4383.9930999999997,19971.5239,"",null,"Orig",67101006]
[null,"6088","Rezidenti 2017 - nelékařské obory",0,0,0,0,0,16318.196400000001,0,0,0,16318.196400000001,0,0,32636.392800000001,"",null,"Orig",67101006]
[null,"",{"$f":"IFERROR(VLOOKUP(B132,CisNS!$A:$B,2,FALSE),\"\")","v":""},null,null,null,null,null,null,null,null,null,null,null,null,0,"",null,null,{"$f":"T107","v":67101006},"End"]
[]
[67101010,"Transfery MZ - RIV (institucionální podpora)",null,{"$f":"SUM(D135:D163)","v":0},{"$f":"SUM(E135:E163)","v":0},{"$f":"SUM(F135:F163)","v":0},{"$f":"SUM(G135:G163)","v":8000000},{"$f":"SUM(H135:H163)","v":0},{"$f":"SUM(I135:I163)","v":0},{"$f":"SUM(J135:J163)","v":0},{"$f":"SUM(K135:K163)","v":0},{"$f":"SUM(L135:L163)","v":0},{"$f":"SUM(M135:M163)","v":0},{"$f":"SUM(N135:N163)","v":0},{"$f":"SUM(O135:O163)","v":0},{"$f":"SUM(P135:P163)","v":8000000},{"$f":"ROUND(P134-SUMIF('1_Původní'!A:A,'2_Upravený'!A134,'1_Původní'!P:P),0)","v":0}]
[null,"8711","RIV: doc. Mgr. Jan Bouchal, PhD.",0,0,0,0,0,0,0,0,0,0,0,0,{"$f":"SUM(D135:O135)","v":0},{"$f":"IF(AND(ROUND(P135,0)<>0,B135=\"\"),\"Obrat bez specifikace NS\",\"\")","v":""},null,"Orig",{"$f":"$A$134","v":67101010}]
[null,"8712","RIV: prof. MUDr. Jiří Gallo, PhD.",0,0,0,0,0,0,0,0,0,0,0,0,{"$f":"SUM(D136:O136)","v":0},{"$f":"IF(AND(ROUND(P136,0)<>0,B136=\"\"),\"Obrat bez specifikace NS\",\"\")","v":""},null,"Orig",{"$f":"$A$134","v":67101010}]
[null,"8713","RIV: MUDr. Matěj Halaj",0,0,0,0,0,0,0,0,0,0,0,0,0,"",null,"Orig",67101010]
[null,"8715","RIV: MUDr. Karel Huml",0,0,0,200000,0,0,0,0,0,0,0,0,200000,"",null,"Orig",67101010]
[null,"8716","RIV: MUDr. Beáta Hutyrová, PhD.",0,0,0,300000,0,0,0,0,0,0,0,0,300000,"",null,"Orig",67101010]
[null,"8719","RIV: MUDr. Hana Klosová, PhD.",0,0,0,300000,0,0,0,0,0,0,0,0,300000,"",null,"Orig",67101010]
[null,"8720","RIV: MUDr. Petr Kolář, PhD.",0,0,0,300000,0,0,0,0,0,0,0,0,300000,"",null,"Orig",67101010]
[null,"8721","RIV: MUDr. Andrea Smržová",0,0,0,300000,0,0,0,0,0,0,0,0,300000,"",null,"Orig",67101010]
[null,"8724","RIV: MUDr. Vladimír Študent, PhD.",0,0,0,300000,0,0,0,0,0,0,0,0,300000,"",null,"Orig",67101010]
[null,"8725","RIV: MUDr. Helena Urbánková",0,0,0,300000,0,0,0,0,0,0,0,0,300000,"",null,"Orig",67101010]
[null,"8726","RIV: Mgr. Petr Vrtěl",0,0,0,300000,0,0,0,0,0,0,0,0,300000,"",null,"Orig",67101010]
[null,"8753","RIV: MUDr. Richard Salzmann, Ph.D.",0,0,0,300000,0,0,0,0,0,0,0,0,300000,"",null,"Orig",67101010]
[null,"8760","RIV: RNDr. Martin Novák, Ph.D.",0,0,0,300000,0,0,0,0,0,0,0,0,300000,"",null,"Orig",67101010]
[null,"8762","RIV - Doc. MUDr. David Karásek, Ph. D.",0,0,0,300000,0,0,0,0,0,0,0,0,300000,"",null,"Orig",67101010]
[null,"8777","RIV: Prof. MUDr. Radovan Pilka, Ph.D.",0,0,0,300000,0,0,0,0,0,0,0,0,300000,"",null,"Orig",67101010]
[null,"8780","RIV - MUDr. Eva Karásková",0,0,0,300000,0,0,0,0,0,0,0,0,300000,"",null,"Orig",67101010]
[null,"8782","RIV - RNDr. Pavlína Čapková, Ph. D.",0,0,0,300000,0,0,0,0,0,0,0,0,300000,"",null,"Orig",67101010]
[null,"8785","RIV - Doc. MUDr. Martin Hutyra, Ph. D.",0,0,0,300000,0,0,0,0,0,0,0,0,300000,"",null,"Orig",67101010]
[null,"8789","RIV - Doc. MUDr. Kateřina Menšíková, Ph. D. - MEX",0,0,0,0,0,0,0,0,0,0,0,0,0,"",null,"Orig",67101010]
[null,"8791","RIV - Doc. Mgr. Luděk Slavík, Ph. D. - MEX",0,0,0,0,0,0,0,0,0,0,0,0,0,"",null,"Orig",67101010]
[null,"8792","RIV - Prof. MUDr. Jiří Gallo, Ph. D. - MEX",0,0,0,0,0,0,0,0,0,0,0,0,0,"",null,"Orig",67101010]
[null,"8793","RIV: prof. MUDr. Milan Raška, PhD. - MEX",0,0,0,0,0,0,0,0,0,0,0,0,0,"",null,"Orig",67101010]
[null,"8794","RIV: MUDr. Martin Loveček, PhD. - MEX",0,0,0,600000,0,0,0,0,0,0,0,0,600000,"",null,"Orig",67101010]
[null,"8795",{"$f":"IFERROR(VLOOKUP(B158,CisNS!$A:$B,2,FALSE),\"\")","v":"RIV: doc. MUDr. Martin Vrba , PhD. - MEX"},0,0,0,600000,0,0,0,0,0,0,0,0,{"$f":"SUM(D158:O158)","v":600000},{"$f":"IF(AND(ROUND(P158,0)<>0,B158=\"\"),\"Obrat bez specifikace NS\",\"\")","v":""},null,null,67101010]
[null,"8796",{"$f":"IFERROR(VLOOKUP(B159,CisNS!$A:$B,2,FALSE),\"\")","v":"RIV: doc. MUDr. Přemysl Falt, PhD. - MEX"},0,0,0,600000,0,0,0,0,0,0,0,0,{"$f":"SUM(D159:O159)","v":600000},{"$f":"IF(AND(ROUND(P159,0)<>0,B159=\"\"),\"Obrat bez specifikace NS\",\"\")","v":""},null,null,67101010]
[null,"8797",{"$f":"IFERROR(VLOOKUP(B160,CisNS!$A:$B,2,FALSE),\"\")","v":"RIV: prof. MUDr. Jiří Gallo, PhD. - MEX"},0,0,0,600000,0,0,0,0,0,0,0,0,{"$f":"SUM(D160:O160)","v":600000},{"$f":"IF(AND(ROUND(P160,0)<>0,B160=\"\"),\"Obrat bez specifikace NS\",\"\")","v":""},null,null,67101010]
[null,"8798",{"$f":"IFERROR(VLOOKUP(B161,CisNS!$A:$B,2,FALSE),\"\")","v":"RIV: prof. MUDr. Miloš Táborský, PhD. - MEX"},0,0,0,600000,0,0,0,0,0,0,0,0,{"$f":"SUM(D161:O161)","v":600000},{"$f":"IF(AND(ROUND(P161,0)<>0,B161=\"\"),\"Obrat bez specifikace NS\",\"\")","v":""},null,null,67101010]
[null,"8799",{"$f":"IFERROR(VLOOKUP(B162,CisNS!$A:$B,2,FALSE),\"\")","v":"RIV: doc. MUDr. Radek Vodička, PhD. - MEX"},0,0,0,600000,0,0,0,0,0,0,0,0,{"$f":"SUM(D162:O162)","v":600000},{"$f":"IF(AND(ROUND(P162,0)<>0,B162=\"\"),\"Obrat bez specifikace NS\",\"\")","v":""},null,null,67101010]
[null,null,{"$f":"IFERROR(VLOOKUP(B163,CisNS!$A:$B,2,FALSE),\"\")","v":""},null,null,null,null,null,null,null,null,null,null,null,null,0,"",null,null,{"$f":"T135","v":67101010},"End"]
[]
[67101011,"Transfery MZ - MEDEVAC (humanitární program)",null,{"$f":"SUM(D166:D168)","v":0},{"$f":"SUM(E166:E168)","v":0},{"$f":"SUM(F166:F168)","v":0},{"$f":"SUM(G166:G168)","v":0},{"$f":"SUM(H166:H168)","v":0},{"$f":"SUM(I166:I168)","v":0},{"$f":"SUM(J166:J168)","v":0},{"$f":"SUM(K166:K168)","v":0},{"$f":"SUM(L166:L168)","v":0},{"$f":"SUM(M166:M168)","v":0},{"$f":"SUM(N166:N168)","v":403000},{"$f":"SUM(O166:O168)","v":0},{"$f":"SUM(P166:P168)","v":403000},{"$f":"ROUND(P165-SUMIF('1_Původní'!A:A,'2_Upravený'!A165,'1_Původní'!P:P),0)","v":0}]
[null,"9813","MEDEVAC",0,0,0,0,0,0,0,0,0,0,0,0,{"$f":"SUM(D166:O166)","v":0},{"$f":"IF(AND(ROUND(P166,0)<>0,B166=\"\"),\"Obrat bez specifikace NS\",\"\")","v":""},null,"Orig",{"$f":"$A$5","v":64908009}]
[null,"9810",{"$f":"IFERROR(VLOOKUP(B167,CisNS!$A:$B,2,FALSE),\"\")","v":"TranMZČR: Zabezpečení svoláv. a varovného sys.-MZ"},null,null,null,null,null,null,null,null,null,null,403000,null,{"$f":"SUM(D167:O167)","v":403000},{"$f":"IF(AND(ROUND(P167,0)<>0,B167=\"\"),\"Obrat bez specifikace NS\",\"\")","v":""},null,null,64908009]
[null,"",{"$f":"IFERROR(VLOOKUP(B168,CisNS!$A:$B,2,FALSE),\"\")","v":""},null,null,null,null,null,null,null,null,null,null,null,null,0,"",null,null,{"$f":"T166","v":64908009},"End"]
[]
[67102001,"Transfery jiného poskytovatele - VaV věcné",null,{"$f":"SUM(D171:D204)","v":0},{"$f":"SUM(E171:E204)","v":0},{"$f":"SUM(F171:F204)","v":0},{"$f":"SUM(G171:G204)","v":372000},{"$f":"SUM(H171:H204)","v":1776000},{"$f":"SUM(I171:I204)","v":2583000},{"$f":"SUM(J171:J204)","v":0},{"$f":"SUM(K171:K204)","v":0},{"$f":"SUM(L171:L204)","v":0},{"$f":"SUM(M171:M204)","v":0},{"$f":"SUM(N171:N204)","v":0},{"$f":"SUM(O171:O204)","v":-0.40539999999999998},{"$f":"SUM(P171:P204)","v":4730999.5945999995},{"$f":"ROUND(P170-SUMIF('1_Původní'!A:A,'2_Upravený'!A170,'1_Původní'!P:P),0)","v":0}]
[null,"8542","Prof. MUDr. Jiří Ehrmann, Ph.D. - PATOL",0,0,0,0,0,0,0,0,0,0,0,0,{"$f":"SUM(D171:O171)","v":0},{"$f":"IF(AND(ROUND(P171,0)<>0,B171=\"\"),\"Obrat bez specifikace NS\",\"\")","v":""},null,"Orig",{"$f":"$A$170","v":67102001}]
[null,"8544","MUDr. Jana Volejníková, Ph.D. - DK",0,0,0,0,0,0,0,0,0,0,0,0,{"$f":"SUM(D172:O172)","v":0},{"$f":"IF(AND(ROUND(P172,0)<>0,B172=\"\"),\"Obrat bez specifikace NS\",\"\")","v":""},null,"Orig",{"$f":"$A$170","v":67102001}]
[null,"8551","Doc. MUDr. Vladimír Študent, PhD. - UROL",0,0,0,0,0,0,0,0,0,0,0,0,0,"",null,"Orig",67102001]
[null,"8552","Doc. MUDr. Jiří Minařík, PhD. - HOK",0,0,0,0,0,0,0,0,0,0,0,0,0,"",null,"Orig",67102001]
[null,"8553","MUDr. Hana Študentová, Ph.D. - ONKO",0,0,0,0,0,0,0,0,0,0,0,0,0,"",null,"Orig",67102001]
[null,"8555","Doc. RNDr. Radek Vrtěl, PhD. - GENETIKA",0,0,0,0,0,0,0,0,0,0,0,0,0,"",null,"Orig",67102001]
[null,"8556","MUDr. Tomáš Veverka, PhD. - NEUROL",0,0,0,0,0,0,0,0,0,0,0,0,{"$f":"SUM(D177:O177)","v":0},"",null,"Orig",67102001]
[null,"8557","MUDr. Petr Šantavý, PhD. - KARDIOCHIR",0,0,0,0,0,0,0,0,0,0,0,0,0,"",null,"Orig",67102001]
[null,"8558","MUDr. Filip Čtvrtlík, PhD. - RTG",0,0,0,0,0,0,0,0,0,0,0,0,0,"",null,"Orig",67102001]
[null,"8559","MUDr. JUDr. Dušan Klos, Ph.D. - I.CHIR",0,0,0,0,0,521000,0,0,0,0,0,0,521000,"",null,"Orig",67102001]
[null,"8560","Mgr. Lenka Kocourková - LEM",0,0,0,0,0,212000,0,0,0,0,0,0,212000,"",null,"Orig",67102001]
[null,"8561","MUDr. Ondřej Krystyník - III. IK",0,0,0,0,0,729000,0,0,0,0,0,0,729000,"",null,"Orig",67102001]
[null,"8562","Mgr. Taťána Štosová, Ph.D. - MIKRO",0,0,0,0,0,98000,0,0,0,0,0,0,98000,"",null,"Orig",67102001]
[null,"8563","Doc. MUDr. Jan Minařík, Ph.D. - HOK",0,0,0,0,0,311000,0,0,0,0,0,0,311000,"",null,"Orig",67102001]
[null,"8564","MUDr. Jan Přeček, Ph.D. - I.IK",0,0,0,0,0,61000,0,0,0,0,0,0,61000,"",null,"Orig",67102001]
[null,"8565","Prof. MUDr. Ing. Petr Hluštík, Ph.D. - NEUROL",0,0,0,0,230000,0,0,0,0,0,0,0,230000,"",null,"Orig",67102001]
[null,"8566","MUDr. Michaela Kaiserová - NEUROL",0,0,0,0,131000,0,0,0,0,0,0,0,131000,"",null,"Orig",67102001]
[null,"8567","MUDr. Jana Petřková, Ph.D. - I.IK",0,0,0,0,91000,0,0,0,0,0,0,0,91000,"",null,"Orig",67102001]
[null,"8568","Prof. MUDr. Dagmar Pospíšilová, Ph.D. - DK",0,0,0,0,0,124000,0,0,0,0,0,0,124000,"",null,"Orig",67102001]
[null,"8569","MUDr. Přemysl Falt, Ph.D. - II.IK",0,0,0,0,0,136000,0,0,0,0,0,0,136000,"",null,"Orig",67102001]
[null,"8570","Prof. MUDr. Bohuslav Melichar, Ph.D. - ONKO",0,0,0,0,0,0,0,0,0,0,0,0,0,"",null,"Orig",67102001]
[null,"8571","MUDr. Tomáš Skála, Ph.D., FESC - I.IK",0,0,0,0,79000,0,0,0,0,0,0,0,79000,"",null,"Orig",67102001]
[null,"8572","Grant: Doc. MUDr. Petr Šantavý, Ph.D. - KARDIOCHIR",0,0,0,0,337000,0,0,0,0,0,0,-0.40539999999999998,336999.59460000001,"",null,"Orig",67102001]
[null,"8573","Grant: MUDr. Jan Přeček, PhD. - I.IK",0,0,0,0,29000,0,0,0,0,0,0,0,29000,"",null,"Orig",67102001]
[null,"8574","Grant: Doc. MUDr. Kateřina Menšíková, PhD. - NEURO",0,0,0,0,506000,0,0,0,0,0,0,0,506000,"",null,"Orig",67102001]
[null,"8575","Grant: Doc. MUDr. Miroslav Vaverka, CSc. - NEUROCH",0,0,0,0,0,80000,0,0,0,0,0,0,80000,"",null,"Orig",67102001]
[null,"8576","Grant: MUDr. Vladislav Raclavský, PhD. - MIKRO",0,0,0,0,0,211000,0,0,0,0,0,0,211000,"",null,"Orig",67102001]
[null,"8577","Grant: Prof. MUDr. Bohuslav Melichar, Ph.D. - ONKO",0,0,0,0,0,100000,0,0,0,0,0,0,100000,"",null,"Orig",67102001]
[null,"8578","Grant: Prof. MUDr. Mgr. Milan Raška, PhD. - IMUNO",0,0,0,0,130000,0,0,0,0,0,0,0,130000,"",null,"Orig",67102001]
[null,"8579","Grant: Prof. MUDr. Dagmar Pospíšilová, PhD. - DK",0,0,0,0,243000,0,0,0,0,0,0,0,243000,"",null,"Orig",67102001]
[null,"8580",{"$f":"IFERROR(VLOOKUP(B201,CisNS!$A:$B,2,FALSE),\"\")","v":"Grant: Doc. MUDr. Martin Doležel, PhD. - ONKOL"},0,0,0,162000,0,0,0,0,0,0,0,0,{"$f":"SUM(D201:O201)","v":162000},{"$f":"IF(AND(ROUND(P201,0)<>0,B201=\"\"),\"Obrat bez specifikace NS\",\"\")","v":""},null,null,67102001]
[null,"8581",{"$f":"IFERROR(VLOOKUP(B202,CisNS!$A:$B,2,FALSE),\"\")","v":"Grant: Doc. MUDr. Ondřej Urban, PhD. - II. IK"},0,0,0,153000,0,0,0,0,0,0,0,0,{"$f":"SUM(D202:O202)","v":153000},{"$f":"IF(AND(ROUND(P202,0)<>0,B202=\"\"),\"Obrat bez specifikace NS\",\"\")","v":""},null,null,67102001]
[null,"8582",{"$f":"IFERROR(VLOOKUP(B203,CisNS!$A:$B,2,FALSE),\"\")","v":"Grant: MUDr. Tomáš Skála, PhD. FESC - I. IK"},0,0,0,57000,0,0,0,0,0,0,0,0,{"$f":"SUM(D203:O203)","v":57000},{"$f":"IF(AND(ROUND(P203,0)<>0,B203=\"\"),\"Obrat bez specifikace NS\",\"\")","v":""},null,null,67102001]
[null,"",{"$f":"IFERROR(VLOOKUP(B204,CisNS!$A:$B,2,FALSE),\"\")","v":""},null,null,null,null,null,null,null,null,null,null,null,null,0,"",null,null,{"$f":"T171","v":67102001},"End"]
[]
[67102002,"Transfery jiného poskytovatele - VaV mzdové",null,{"$f":"SUM(D207:D240)","v":0},{"$f":"SUM(E207:E240)","v":0},{"$f":"SUM(F207:F240)","v":0},{"$f":"SUM(G207:G240)","v":1161000},{"$f":"SUM(H207:H240)","v":3515000},{"$f":"SUM(I207:I240)","v":4234000},{"$f":"SUM(J207:J240)","v":0},{"$f":"SUM(K207:K240)","v":0},{"$f":"SUM(L207:L240)","v":0},{"$f":"SUM(M207:M240)","v":0},{"$f":"SUM(N207:N240)","v":0},{"$f":"SUM(O207:O240)","v":0},{"$f":"SUM(P207:P240)","v":8910000},{"$f":"ROUND(P206-SUMIF('1_Původní'!A:A,'2_Upravený'!A206,'1_Původní'!P:P),0)","v":0}]
[null,"8542","Prof. MUDr. Jiří Ehrmann, Ph.D. - PATOL",0,0,0,0,0,0,0,0,0,0,0,0,{"$f":"SUM(D207:O207)","v":0},{"$f":"IF(AND(ROUND(P207,0)<>0,B207=\"\"),\"Obrat bez specifikace NS\",\"\")","v":""},null,"Orig",{"$f":"$A$206","v":67102002}]
[null,"8544","MUDr. Jana Volejníková, Ph.D. - DK",0,0,0,0,0,0,0,0,0,0,0,0,{"$f":"SUM(D208:O208)","v":0},{"$f":"IF(AND(ROUND(P208,0)<>0,B208=\"\"),\"Obrat bez specifikace NS\",\"\")","v":""},null,"Orig",{"$f":"$A$206","v":67102002}]
[null,"8551","Doc. MUDr. Vladimír Študent, PhD. - UROL",0,0,0,0,0,0,0,0,0,0,0,0,0,"",null,"Orig",67102002]
[null,"8552","Doc. MUDr. Jiří Minařík, PhD. - HOK",0,0,0,0,0,0,0,0,0,0,0,0,0,"",null,"Orig",67102002]
[null,"8553","MUDr. Hana Študentová, Ph.D. - ONKO",0,0,0,0,0,0,0,0,0,0,0,0,0,"",null,"Orig",67102002]
[null,"8555","Doc. RNDr. Radek Vrtěl, PhD. - GENETIKA",0,0,0,0,0,0,0,0,0,0,0,0,0,"",null,"Orig",67102002]
[null,"8556","MUDr. Tomáš Veverka, PhD. - NEUROL",0,0,0,0,0,0,0,0,0,0,0,0,0,"",null,"Orig",67102002]
[null,"8557","MUDr. Petr Šantavý, PhD. - KARDIOCHIR",0,0,0,0,0,0,0,0,0,0,0,0,0,"",null,"Orig",67102002]
[null,"8558","MUDr. Filip Čtvrtlík, PhD. - RTG",0,0,0,0,0,0,0,0,0,0,0,0,0,"",null,"Orig",67102002]
[null,"8559","MUDr. JUDr. Dušan Klos, Ph.D. - I.CHIR",0,0,0,0,0,783000,0,0,0,0,0,0,783000,"",null,"Orig",67102002]
[null,"8560","Mgr. Lenka Kocourková - LEM",0,0,0,0,0,221000,0,0,0,0,0,0,221000,"",null,"Orig",67102002]
[null,"8561","MUDr. Ondřej Krystyník - III. IK",0,0,0,0,0,442000,0,0,0,0,0,0,442000,"",null,"Orig",67102002]
[null,"8562","Mgr. Taťána Štosová, Ph.D. - MIKRO",0,0,0,0,0,154000,0,0,0,0,0,0,154000,"",null,"Orig",67102002]
[null,"8563","Doc. MUDr. Jan Minařík, Ph.D. - HOK",0,0,0,0,0,297000,0,0,0,0,0,0,297000,"",null,"Orig",67102002]
[null,"8564","MUDr. Jan Přeček, Ph.D. - I.IK",0,0,0,0,0,308000,0,0,0,0,0,0,308000,"",null,"Orig",67102002]
[null,"8565","Prof. MUDr. Ing. Petr Hluštík, Ph.D. - NEUROL",0,0,0,0,537000,0,0,0,0,0,0,0,537000,"",null,"Orig",67102002]
[null,"8566","MUDr. Michaela Kaiserová - NEUROL",0,0,0,0,507000,0,0,0,0,0,0,0,507000,"",null,"Orig",67102002]
[null,"8567","MUDr. Jana Petřková, Ph.D. - I.IK",0,0,0,0,190000,0,0,0,0,0,0,0,190000,"",null,"Orig",67102002]
[null,"8568","Prof. MUDr. Dagmar Pospíšilová, Ph.D. - DK",0,0,0,0,0,190000,0,0,0,0,0,0,190000,"",null,"Orig",67102002]
[null,"8569","MUDr. Přemysl Falt, Ph.D. - II.IK",0,0,0,0,0,322000,0,0,0,0,0,0,322000,"",null,"Orig",67102002]
[null,"8570","Prof. MUDr. Bohuslav Melichar, Ph.D. - ONKO",0,0,0,0,0,0,0,0,0,0,0,0,0,"",null,"Orig",67102002]
[null,"8571","MUDr. Tomáš Skála, Ph.D., FESC - I.IK",0,0,0,0,286000,0,0,0,0,0,0,0,286000,"",null,"Orig",67102002]
[null,"8572","Grant: Doc. MUDr. Petr Šantavý, Ph.D. - KARDIOCHIR",0,0,0,0,267000,0,0,0,0,0,0,0,267000,"",null,"Orig",67102002]
[null,"8573","Grant: MUDr. Jan Přeček, PhD. - I.IK",0,0,0,0,213000,0,0,0,0,0,0,0,213000,"",null,"Orig",67102002]
[null,"8574","Grant: Doc. MUDr. Kateřina Menšíková, PhD. - NEURO",0,0,0,0,691000,0,0,0,0,0,0,0,691000,"",null,"Orig",67102002]
[null,"8575","Grant: Doc. MUDr. Miroslav Vaverka, CSc. - NEUROCH",0,0,0,0,0,286000,0,0,0,0,0,0,286000,"",null,"Orig",67102002]
[null,"8576","Grant: MUDr. Vladislav Raclavský, PhD. - MIKRO",0,0,0,0,0,775000,0,0,0,0,0,0,775000,"",null,"Orig",67102002]
[null,"8577","Grant: Prof. MUDr. Bohuslav Melichar, Ph.D. - ONKO",0,0,0,0,0,456000,0,0,0,0,0,0,456000,"",null,"Orig",67102002]
[null,"8578","Grant: Prof. MUDr. Mgr. Milan Raška, PhD. - IMUNO",0,0,0,0,465000,0,0,0,0,0,0,0,465000,"",null,"Orig",67102002]
[null,"8579","Grant: Prof. MUDr. Dagmar Pospíšilová, PhD. - DK",0,0,0,0,359000,0,0,0,0,0,0,0,359000,"",null,"Orig",67102002]
[null,"8580",{"$f":"IFERROR(VLOOKUP(B237,CisNS!$A:$B,2,FALSE),\"\")","v":"Grant: Doc. MUDr. Martin Doležel, PhD. - ONKOL"},0,0,0,432000,0,0,0,0,0,0,0,0,{"$f":"SUM(D237:O237)","v":432000},{"$f":"IF(AND(ROUND(P237,0)<>0,B237=\"\"),\"Obrat bez specifikace NS\",\"\")","v":""},null,null,67102002]
[null,"8581",{"$f":"IFERROR(VLOOKUP(B238,CisNS!$A:$B,2,FALSE),\"\")","v":"Grant: Doc. MUDr. Ondřej Urban, PhD. - II. IK"},0,0,0,388000,0,0,0,0,0,0,0,0,{"$f":"SUM(D238:O238)","v":388000},{"$f":"IF(AND(ROUND(P238,0)<>0,B238=\"\"),\"Obrat bez specifikace NS\",\"\")","v":""},null,null,67102002]
[null,"8582",{"$f":"IFERROR(VLOOKUP(B239,CisNS!$A:$B,2,FALSE),\"\")","v":"Grant: MUDr. Tomáš Skála, PhD. FESC - I. IK"},0,0,0,341000,0,0,0,0,0,0,0,0,{"$f":"SUM(D239:O239)","v":341000},{"$f":"IF(AND(ROUND(P239,0)<>0,B239=\"\"),\"Obrat bez specifikace NS\",\"\")","v":""},null,null,67102002]
[null,"",{"$f":"IFERROR(VLOOKUP(B240,CisNS!$A:$B,2,FALSE),\"\")","v":""},null,null,null,null,null,null,null,null,null,null,null,null,0,"",null,null,{"$f":"T207","v":67102002},"End"]
[]
[67102004,"Transfery jiného poskytovatele - ostatní",null,{"$f":"SUM(D243:D247)","v":700416.66669999994},{"$f":"SUM(E243:E247)","v":700416.66669999994},{"$f":"SUM(F243:F247)","v":700416.66669999994},{"$f":"SUM(G243:G247)","v":700416.66669999994},{"$f":"SUM(H243:H247)","v":700416.66669999994},{"$f":"SUM(I243:I247)","v":700416.66669999994},{"$f":"SUM(J243:J247)","v":700416.66669999994},{"$f":"SUM(K243:K247)","v":700416.66669999994},{"$f":"SUM(L243:L247)","v":700416.66669999994},{"$f":"SUM(M243:M247)","v":700416.66669999994},{"$f":"SUM(N243:N247)","v":700416.66669999994},{"$f":"SUM(O243:O247)","v":700416.66669999994},{"$f":"SUM(P243:P247)","v":8405000.0003999993},{"$f":"ROUND(P242-SUMIF('1_Původní'!A:A,'2_Upravený'!A242,'1_Původní'!P:P),0)","v":0}]
[null,"5106","NTMC: SHAPES",363666.6667,363666.6667,363666.6667,363666.6667,363666.6667,363666.6667,363666.6667,363666.6667,363666.6667,363666.6667,363666.6667,363666.6667,{"$f":"SUM(D243:O243)","v":4364000.0004000003},{"$f":"IF(AND(ROUND(P243,0)<>0,B243=\"\"),\"Obrat bez specifikace NS\",\"\")","v":""},null,"Orig",{"$f":"$A$242","v":67102004}]
[null,"5107","NTMC: PROFID",67083.333299999998,67083.333299999998,67083.333299999998,67083.333299999998,67083.333299999998,67083.333299999998,67083.333299999998,67083.333299999998,67083.333299999998,67083.333299999998,67083.333299999998,67083.333299999998,{"$f":"SUM(D244:O244)","v":804999.99960000021},{"$f":"IF(AND(ROUND(P244,0)<>0,B244=\"\"),\"Obrat bez specifikace NS\",\"\")","v":""},null,"Orig",{"$f":"$A$242","v":67102004}]
[null,"5108","NTMC: Projekt niCE-life",172500,172500,172500,172500,172500,172500,172500,172500,172500,172500,172500,172500,2070000,"",null,"Orig",67102004]
[null,"5110","NTMC: Projekt X",97166.666700000002,97166.666700000002,97166.666700000002,97166.666700000002,97166.666700000002,97166.666700000002,97166.666700000002,97166.666700000002,97166.666700000002,97166.666700000002,97166.666700000002,97166.666700000002,1166000.0003999998,"",null,"Orig",67102004]
[null,"",{"$f":"IFERROR(VLOOKUP(B247,CisNS!$A:$B,2,FALSE),\"\")","v":""},null,null,null,null,null,null,null,null,null,null,null,null,0,"",null,null,{"$f":"T243","v":67102004},"End"]

{"sheet":"3_Rozdíly","index":4,"n_rows":247,"n_cols":16,"rows_kept":247,"cut":false,"hidden":true,"merged":[]}
["Legenda",null,"Hodnoty v CZK"]
["Účet","Název účtu"]
[null,"NS","Název NS",{"$f":"MID(Summary!$B$2,18,4)&\"01\"","v":"202101"},{"$f":"MID(Summary!$B$2,18,4)&\"02\"","v":"202102"},{"$f":"MID(Summary!$B$2,18,4)&\"03\"","v":"202103"},{"$f":"MID(Summary!$B$2,18,4)&\"04\"","v":"202104"},{"$f":"MID(Summary!$B$2,18,4)&\"05\"","v":"202105"},{"$f":"MID(Summary!$B$2,18,4)&\"06\"","v":"202106"},{"$f":"MID(Summary!$B$2,18,4)&\"07\"","v":"202107"},{"$f":"MID(Summary!$B$2,18,4)&\"08\"","v":"202108"},{"$f":"MID(Summary!$B$2,18,4)&\"09\"","v":"202109"},{"$f":"MID(Summary!$B$2,18,4)&\"10\"","v":"202110"},{"$f":"MID(Summary!$B$2,18,4)&\"11\"","v":"202111"},{"$f":"MID(Summary!$B$2,18,4)&\"12\"","v":"202112"},{"$f":"MID(Summary!$B$2,18,4)&\" celkem\"","v":"2021 celkem"}]
[]
[64908009,"Smlouva o účelově vázané úplatě",null,{"$f":"SUM(D7:D7)","v":0},0,0,0,0,0,0,0,0,0,0,0,0]
[null,{"$f":"IF('2_Upravený'!B6=\"\",\"\",'2_Upravený'!B6)","v":"4803"},{"$f":"IF('2_Upravený'!C6=\"\",\"\",'2_Upravený'!C6)","v":"OP - specializační vzdělávání klinických farmaceutů"},{"$f":"'2_Upravený'!D6-'1_Původní'!D6","v":0},{"$f":"'2_Upravený'!E6-'1_Původní'!E6","v":0},{"$f":"'2_Upravený'!F6-'1_Původní'!F6","v":0},{"$f":"'2_Upravený'!G6-'1_Původní'!G6","v":0},{"$f":"'2_Upravený'!H6-'1_Původní'!H6","v":0},{"$f":"'2_Upravený'!I6-'1_Původní'!I6","v":0},{"$f":"'2_Upravený'!J6-'1_Původní'!J6","v":0},{"$f":"'2_Upravený'!K6-'1_Původní'!K6","v":0},{"$f":"'2_Upravený'!L6-'1_Původní'!L6","v":0},{"$f":"'2_Upravený'!M6-'1_Původní'!M6","v":0},{"$f":"'2_Upravený'!N6-'1_Původní'!N6","v":0},{"$f":"'2_Upravený'!O6-'1_Původní'!O6","v":0},{"$f":"SUM(D6:O6)","v":0}]
[null,{"$f":"IF('2_Upravený'!B7=\"\",\"\",'2_Upravený'!B7)","v":""},{"$f":"IF('2_Upravený'!C7=\"\",\"\",'2_Upravený'!C7)","v":""},{"$f":"'2_Upravený'!D7-'1_Původní'!D7","v":0},{"$f":"'2_Upravený'!E7-'1_Původní'!E7","v":0},{"$f":"'2_Upravený'!F7-'1_Původní'!F7","v":0},{"$f":"'2_Upravený'!G7-'1_Původní'!G7","v":0},{"$f":"'2_Upravený'!H7-'1_Původní'!H7","v":0},{"$f":"'2_Upravený'!I7-'1_Původní'!I7","v":0},{"$f":"'2_Upravený'!J7-'1_Původní'!J7","v":0},{"$f":"'2_Upravený'!K7-'1_Původní'!K7","v":0},{"$f":"'2_Upravený'!L7-'1_Původní'!L7","v":0},{"$f":"'2_Upravený'!M7-'1_Původní'!M7","v":0},{"$f":"'2_Upravený'!N7-'1_Původní'!N7","v":0},{"$f":"'2_Upravený'!O7-'1_Původní'!O7","v":0},{"$f":"SUM(D7:O7)","v":0}]
[]
[64924438,"Výkony etické komise",null,{"$f":"SUM(D11:D11)","v":0},0,0,0,0,0,0,0,0,0,0,0,0]
[null,{"$f":"IF('2_Upravený'!B10=\"\",\"\",'2_Upravený'!B10)","v":"9003"},{"$f":"IF('2_Upravený'!C10=\"\",\"\",'2_Upravený'!C10)","v":"Etická komise"},{"$f":"'2_Upravený'!D10-'1_Původní'!D10","v":0},{"$f":"'2_Upravený'!E10-'1_Původní'!E10","v":0},{"$f":"'2_Upravený'!F10-'1_Původní'!F10","v":0},{"$f":"'2_Upravený'!G10-'1_Původní'!G10","v":0},{"$f":"'2_Upravený'!H10-'1_Původní'!H10","v":0},{"$f":"'2_Upravený'!I10-'1_Původní'!I10","v":0},{"$f":"'2_Upravený'!J10-'1_Původní'!J10","v":0},{"$f":"'2_Upravený'!K10-'1_Původní'!K10","v":0},{"$f":"'2_Upravený'!L10-'1_Původní'!L10","v":0},{"$f":"'2_Upravený'!M10-'1_Původní'!M10","v":0},{"$f":"'2_Upravený'!N10-'1_Původní'!N10","v":0},{"$f":"'2_Upravený'!O10-'1_Původní'!O10","v":0},{"$f":"SUM(D10:O10)","v":0}]
[null,{"$f":"IF('2_Upravený'!B11=\"\",\"\",'2_Upravený'!B11)","v":""},{"$f":"IF('2_Upravený'!C11=\"\",\"\",'2_Upravený'!C11)","v":""},{"$f":"'2_Upravený'!D11-'1_Původní'!D11","v":0},{"$f":"'2_Upravený'!E11-'1_Původní'!E11","v":0},{"$f":"'2_Upravený'!F11-'1_Původní'!F11","v":0},{"$f":"'2_Upravený'!G11-'1_Původní'!G11","v":0},{"$f":"'2_Upravený'!H11-'1_Původní'!H11","v":0},{"$f":"'2_Upravený'!I11-'1_Původní'!I11","v":0},{"$f":"'2_Upravený'!J11-'1_Původní'!J11","v":0},{"$f":"'2_Upravený'!K11-'1_Původní'!K11","v":0},{"$f":"'2_Upravený'!L11-'1_Původní'!L11","v":0},{"$f":"'2_Upravený'!M11-'1_Původní'!M11","v":0},{"$f":"'2_Upravený'!N11-'1_Původní'!N11","v":0},{"$f":"'2_Upravený'!O11-'1_Původní'!O11","v":0},0]
[]
[64924439,"Klinické hodnocení - tuzemci (81xx,9003,9028)",null,{"$f":"SUM(D27:D27)","v":0},0,0,0,0,0,0,0,0,0,0,0,0]
[null,{"$f":"IF('2_Upravený'!B14=\"\",\"\",'2_Upravený'!B14)","v":"8101"},{"$f":"IF('2_Upravený'!C14=\"\",\"\",'2_Upravený'!C14)","v":"Klinická hodnocení - I. Interní klinika"},{"$f":"'2_Upravený'!D14-'1_Původní'!D14","v":0},{"$f":"'2_Upravený'!E14-'1_Původní'!E14","v":0},{"$f":"'2_Upravený'!F14-'1_Původní'!F14","v":0},{"$f":"'2_Upravený'!G14-'1_Původní'!G14","v":0},{"$f":"'2_Upravený'!H14-'1_Původní'!H14","v":0},{"$f":"'2_Upravený'!I14-'1_Původní'!I14","v":0},{"$f":"'2_Upravený'!J14-'1_Původní'!J14","v":0},{"$f":"'2_Upravený'!K14-'1_Původní'!K14","v":0},{"$f":"'2_Upravený'!L14-'1_Původní'!L14","v":0},{"$f":"'2_Upravený'!M14-'1_Původní'!M14","v":0},{"$f":"'2_Upravený'!N14-'1_Původní'!N14","v":0},{"$f":"'2_Upravený'!O14-'1_Původní'!O14","v":0},{"$f":"SUM(D14:O14)","v":0}]
[null,{"$f":"IF('2_Upravený'!B15=\"\",\"\",'2_Upravený'!B15)","v":"8103"},{"$f":"IF('2_Upravený'!C15=\"\",\"\",'2_Upravený'!C15)","v":"Klinická hodnocení - III. Interní klinika"},{"$f":"'2_Upravený'!D15-'1_Původní'!D15","v":0},{"$f":"'2_Upravený'!E15-'1_Původní'!E15","v":0},{"$f":"'2_Upravený'!F15-'1_Původní'!F15","v":0},{"$f":"'2_Upravený'!G15-'1_Původní'!G15","v":0},{"$f":"'2_Upravený'!H15-'1_Původní'!H15","v":0},{"$f":"'2_Upravený'!I15-'1_Původní'!I15","v":0},{"$f":"'2_Upravený'!J15-'1_Původní'!J15","v":0},{"$f":"'2_Upravený'!K15-'1_Původní'!K15","v":0},{"$f":"'2_Upravený'!L15-'1_Původní'!L15","v":0},{"$f":"'2_Upravený'!M15-'1_Původní'!M15","v":0},{"$f":"'2_Upravený'!N15-'1_Původní'!N15","v":0},{"$f":"'2_Upravený'!O15-'1_Původní'!O15","v":0},{"$f":"SUM(D15:O15)","v":0}]
[null,{"$f":"IF('2_Upravený'!B16=\"\",\"\",'2_Upravený'!B16)","v":"8108"},{"$f":"IF('2_Upravený'!C16=\"\",\"\",'2_Upravený'!C16)","v":"Klinická hodnocení - Porodnicko-gynekologická klinika"},{"$f":"'2_Upravený'!D16-'1_Původní'!D16","v":0},{"$f":"'2_Upravený'!E16-'1_Původní'!E16","v":0},{"$f":"'2_Upravený'!F16-'1_Původní'!F16","v":0},{"$f":"'2_Upravený'!G16-'1_Původní'!G16","v":0},{"$f":"'2_Upravený'!H16-'1_Původní'!H16","v":0},{"$f":"'2_Upravený'!I16-'1_Původní'!I16","v":0},{"$f":"'2_Upravený'!J16-'1_Původní'!J16","v":0},{"$f":"'2_Upravený'!K16-'1_Původní'!K16","v":0},{"$f":"'2_Upravený'!L16-'1_Původní'!L16","v":0},{"$f":"'2_Upravený'!M16-'1_Původní'!M16","v":0},{"$f":"'2_Upravený'!N16-'1_Původní'!N16","v":0},{"$f":"'2_Upravený'!O16-'1_Původní'!O16","v":0},0]
[null,{"$f":"IF('2_Upravený'!B17=\"\",\"\",'2_Upravený'!B17)","v":"8112"},{"$f":"IF('2_Upravený'!C17=\"\",\"\",'2_Upravený'!C17)","v":"Klinická hodnocení - Urologická klinika"},{"$f":"'2_Upravený'!D17-'1_Původní'!D17","v":0},{"$f":"'2_Upravený'!E17-'1_Původní'!E17","v":0},{"$f":"'2_Upravený'!F17-'1_Původní'!F17","v":0},{"$f":"'2_Upravený'!G17-'1_Původní'!G17","v":0},{"$f":"'2_Upravený'!H17-'1_Původní'!H17","v":0},{"$f":"'2_Upravený'!I17-'1_Původní'!I17","v":0},{"$f":"'2_Upravený'!J17-'1_Původní'!J17","v":0},{"$f":"'2_Upravený'!K17-'1_Původní'!K17","v":0},{"$f":"'2_Upravený'!L17-'1_Původní'!L17","v":0},{"$f":"'2_Upravený'!M17-'1_Původní'!M17","v":0},{"$f":"'2_Upravený'!N17-'1_Původní'!N17","v":0},{"$f":"'2_Upravený'!O17-'1_Původní'!O17","v":0},0]
[null,{"$f":"IF('2_Upravený'!B18=\"\",\"\",'2_Upravený'!B18)","v":"8114"},{"$f":"IF('2_Upravený'!C18=\"\",\"\",'2_Upravený'!C18)","v":"Klinická hodnocení - Oční klinika"},{"$f":"'2_Upravený'!D18-'1_Původní'!D18","v":0},{"$f":"'2_Upravený'!E18-'1_Původní'!E18","v":0},{"$f":"'2_Upravený'!F18-'1_Původní'!F18","v":0},{"$f":"'2_Upravený'!G18-'1_Původní'!G18","v":0},{"$f":"'2_Upravený'!H18-'1_Původní'!H18","v":0},{"$f":"'2_Upravený'!I18-'1_Původní'!I18","v":0},{"$f":"'2_Upravený'!J18-'1_Původní'!J18","v":0},{"$f":"'2_Upravený'!K18-'1_Původní'!K18","v":0},{"$f":"'2_Upravený'!L18-'1_Původní'!L18","v":0},{"$f":"'2_Upravený'!M18-'1_Původní'!M18","v":0},{"$f":"'2_Upravený'!N18-'1_Původní'!N18","v":0},{"$f":"'2_Upravený'!O18-'1_Původní'!O18","v":0},0]
[null,{"$f":"IF('2_Upravený'!B19=\"\",\"\",'2_Upravený'!B19)","v":"8116"},{"$f":"IF('2_Upravený'!C19=\"\",\"\",'2_Upravený'!C19)","v":"Klinická hodnocení - Klinika plicních nemocí a tuberkulózy"},{"$f":"'2_Upravený'!D19-'1_Původní'!D19","v":0},{"$f":"'2_Upravený'!E19-'1_Původní'!E19","v":0},{"$f":"'2_Upravený'!F19-'1_Původní'!F19","v":0},{"$f":"'2_Upravený'!G19-'1_Původní'!G19","v":0},{"$f":"'2_Upravený'!H19-'1_Původní'!H19","v":0},{"$f":"'2_Upravený'!I19-'1_Původní'!I19","v":0},{"$f":"'2_Upravený'!J19-'1_Původní'!J19","v":0},{"$f":"'2_Upravený'!K19-'1_Původní'!K19","v":0},{"$f":"'2_Upravený'!L19-'1_Původní'!L19","v":0},{"$f":"'2_Upravený'!M19-'1_Původní'!M19","v":0},{"$f":"'2_Upravený'!N19-'1_Původní'!N19","v":0},{"$f":"'2_Upravený'!O19-'1_Původní'!O19","v":0},0]
[null,{"$f":"IF('2_Upravený'!B20=\"\",\"\",'2_Upravený'!B20)","v":"8117"},{"$f":"IF('2_Upravený'!C20=\"\",\"\",'2_Upravený'!C20)","v":"Klinická hodnocení - Neurologická klinika"},{"$f":"'2_Upravený'!D20-'1_Původní'!D20","v":0},{"$f":"'2_Upravený'!E20-'1_Původní'!E20","v":0},{"$f":"'2_Upravený'!F20-'1_Původní'!F20","v":0},{"$f":"'2_Upravený'!G20-'1_Původní'!G20","v":0},{"$f":"'2_Upravený'!H20-'1_Původní'!H20","v":0},{"$f":"'2_Upravený'!I20-'1_Původní'!I20","v":0},{"$f":"'2_Upravený'!J20-'1_Původní'!J20","v":0},{"$f":"'2_Upravený'!K20-'1_Původní'!K20","v":0},{"$f":"'2_Upravený'!L20-'1_Původní'!L20","v":0},{"$f":"'2_Upravený'!M20-'1_Původní'!M20","v":0},{"$f":"'2_Upravený'!N20-'1_Původní'!N20","v":0},{"$f":"'2_Upravený'!O20-'1_Původní'!O20","v":0},0]
[null,{"$f":"IF('2_Upravený'!B21=\"\",\"\",'2_Upravený'!B21)","v":"8120"},{"$f":"IF('2_Upravený'!C21=\"\",\"\",'2_Upravený'!C21)","v":"Klinická hodnocení - Klinika chorob kožních a pohlavních"},{"$f":"'2_Upravený'!D21-'1_Původní'!D21","v":0},{"$f":"'2_Upravený'!E21-'1_Původní'!E21","v":0},{"$f":"'2_Upravený'!F21-'1_Původní'!F21","v":0},{"$f":"'2_Upravený'!G21-'1_Původní'!G21","v":0},{"$f":"'2_Upravený'!H21-'1_Původní'!H21","v":0},{"$f":"'2_Upravený'!I21-'1_Původní'!I21","v":0},{"$f":"'2_Upravený'!J21-'1_Původní'!J21","v":0},{"$f":"'2_Upravený'!K21-'1_Původní'!K21","v":0},{"$f":"'2_Upravený'!L21-'1_Původní'!L21","v":0},{"$f":"'2_Upravený'!M21-'1_Původní'!M21","v":0},{"$f":"'2_Upravený'!N21-'1_Původní'!N21","v":0},{"$f":"'2_Upravený'!O21-'1_Původní'!O21","v":0},0]
[null,{"$f":"IF('2_Upravený'!B22=\"\",\"\",'2_Upravený'!B22)","v":"8121"},{"$f":"IF('2_Upravený'!C22=\"\",\"\",'2_Upravený'!C22)","v":"Klinická hodnocení - Onkologická klinika"},{"$f":"'2_Upravený'!D22-'1_Původní'!D22","v":0},{"$f":"'2_Upravený'!E22-'1_Původní'!E22","v":0},{"$f":"'2_Upravený'!F22-'1_Původní'!F22","v":0},{"$f":"'2_Upravený'!G22-'1_Původní'!G22","v":0},{"$f":"'2_Upravený'!H22-'1_Původní'!H22","v":0},{"$f":"'2_Upravený'!I22-'1_Původní'!I22","v":0},{"$f":"'2_Upravený'!J22-'1_Původní'!J22","v":0},{"$f":"'2_Upravený'!K22-'1_Původní'!K22","v":0},{"$f":"'2_Upravený'!L22-'1_Původní'!L22","v":0},{"$f":"'2_Upravený'!M22-'1_Původní'!M22","v":0},{"$f":"'2_Upravený'!N22-'1_Původní'!N22","v":0},{"$f":"'2_Upravený'!O22-'1_Původní'!O22","v":0},0]
[null,{"$f":"IF('2_Upravený'!B23=\"\",\"\",'2_Upravený'!B23)","v":"8127"},{"$f":"IF('2_Upravený'!C23=\"\",\"\",'2_Upravený'!C23)","v":"Klinická hodnocení - Klinika TVL a kardiovask rehabilitace"},{"$f":"'2_Upravený'!D23-'1_Původní'!D23","v":0},{"$f":"'2_Upravený'!E23-'1_Původní'!E23","v":0},{"$f":"'2_Upravený'!F23-'1_Původní'!F23","v":0},{"$f":"'2_Upravený'!G23-'1_Původní'!G23","v":0},{"$f":"'2_Upravený'!H23-'1_Původní'!H23","v":0},{"$f":"'2_Upravený'!I23-'1_Původní'!I23","v":0},{"$f":"'2_Upravený'!J23-'1_Původní'!J23","v":0},{"$f":"'2_Upravený'!K23-'1_Původní'!K23","v":0},{"$f":"'2_Upravený'!L23-'1_Původní'!L23","v":0},{"$f":"'2_Upravený'!M23-'1_Původní'!M23","v":0},{"$f":"'2_Upravený'!N23-'1_Původní'!N23","v":0},{"$f":"'2_Upravený'!O23-'1_Původní'!O23","v":0},0]
[null,{"$f":"IF('2_Upravený'!B24=\"\",\"\",'2_Upravený'!B24)","v":"8132"},{"$f":"IF('2_Upravený'!C24=\"\",\"\",'2_Upravený'!C24)","v":"Klinická hodnocení - Hemato-onkologická klinika"},{"$f":"'2_Upravený'!D24-'1_Původní'!D24","v":0},{"$f":"'2_Upravený'!E24-'1_Původní'!E24","v":0},{"$f":"'2_Upravený'!F24-'1_Původní'!F24","v":0},{"$f":"'2_Upravený'!G24-'1_Původní'!G24","v":0},{"$f":"'2_Upravený'!H24-'1_Původní'!H24","v":0},{"$f":"'2_Upravený'!I24-'1_Původní'!I24","v":0},{"$f":"'2_Upravený'!J24-'1_Původní'!J24","v":0},{"$f":"'2_Upravený'!K24-'1_Původní'!K24","v":0},{"$f":"'2_Upravený'!L24-'1_Původní'!L24","v":0},{"$f":"'2_Upravený'!M24-'1_Původní'!M24","v":0},{"$f":"'2_Upravený'!N24-'1_Původní'!N24","v":0},{"$f":"'2_Upravený'!O24-'1_Původní'!O24","v":0},0]
[null,{"$f":"IF('2_Upravený'!B25=\"\",\"\",'2_Upravený'!B25)","v":"8148"},{"$f":"IF('2_Upravený'!C25=\"\",\"\",'2_Upravený'!C25)","v":"Klinická hodnocení - Lékárna"},{"$f":"'2_Upravený'!D25-'1_Původní'!D25","v":0},{"$f":"'2_Upravený'!E25-'1_Původní'!E25","v":0},{"$f":"'2_Upravený'!F25-'1_Původní'!F25","v":0},{"$f":"'2_Upravený'!G25-'1_Původní'!G25","v":0},{"$f":"'2_Upravený'!H25-'1_Původní'!H25","v":0},{"$f":"'2_Upravený'!I25-'1_Původní'!I25","v":0},{"$f":"'2_Upravený'!J25-'1_Původní'!J25","v":0},{"$f":"'2_Upravený'!K25-'1_Původní'!K25","v":0},{"$f":"'2_Upravený'!L25-'1_Původní'!L25","v":0},{"$f":"'2_Upravený'!M25-'1_Původní'!M25","v":0},{"$f":"'2_Upravený'!N25-'1_Původní'!N25","v":0},{"$f":"'2_Upravený'!O25-'1_Původní'!O25","v":0},0]
[null,{"$f":"IF('2_Upravený'!B26=\"\",\"\",'2_Upravený'!B26)","v":"9028"},{"$f":"IF('2_Upravený'!C26=\"\",\"\",'2_Upravený'!C26)","v":"Oddělení vědy a výzkumu"},{"$f":"'2_Upravený'!D26-'1_Původní'!D26","v":0},{"$f":"'2_Upravený'!E26-'1_Původní'!E26","v":0},{"$f":"'2_Upravený'!F26-'1_Původní'!F26","v":0},{"$f":"'2_Upravený'!G26-'1_Původní'!G26","v":0},{"$f":"'2_Upravený'!H26-'1_Původní'!H26","v":0},{"$f":"'2_Upravený'!I26-'1_Původní'!I26","v":0},{"$f":"'2_Upravený'!J26-'1_Původní'!J26","v":0},{"$f":"'2_Upravený'!K26-'1_Původní'!K26","v":0},{"$f":"'2_Upravený'!L26-'1_Původní'!L26","v":0},{"$f":"'2_Upravený'!M26-'1_Původní'!M26","v":0},{"$f":"'2_Upravený'!N26-'1_Původní'!N26","v":0},{"$f":"'2_Upravený'!O26-'1_Původní'!O26","v":0},0]
[null,{"$f":"IF('2_Upravený'!B27=\"\",\"\",'2_Upravený'!B27)","v":""},{"$f":"IF('2_Upravený'!C27=\"\",\"\",'2_Upravený'!C27)","v":""},{"$f":"'2_Upravený'!D27-'1_Původní'!D27","v":0},{"$f":"'2_Upravený'!E27-'1_Původní'!E27","v":0},{"$f":"'2_Upravený'!F27-'1_Původní'!F27","v":0},{"$f":"'2_Upravený'!G27-'1_Původní'!G27","v":0},{"$f":"'2_Upravený'!H27-'1_Původní'!H27","v":0},{"$f":"'2_Upravený'!I27-'1_Původní'!I27","v":0},{"$f":"'2_Upravený'!J27-'1_Původní'!J27","v":0},{"$f":"'2_Upravený'!K27-'1_Původní'!K27","v":0},{"$f":"'2_Upravený'!L27-'1_Původní'!L27","v":0},{"$f":"'2_Upravený'!M27-'1_Původní'!M27","v":0},{"$f":"'2_Upravený'!N27-'1_Původní'!N27","v":0},{"$f":"'2_Upravený'!O27-'1_Původní'!O27","v":0},0]
[]
[64924440,"Klinické hodnocení - EU (81xx,9003,9028)",null,{"$f":"SUM(D42:D42)","v":0},0,0,0,0,0,0,0,0,0,0,0,0]
[null,{"$f":"IF('2_Upravený'!B30=\"\",\"\",'2_Upravený'!B30)","v":"8101"},{"$f":"IF('2_Upravený'!C30=\"\",\"\",'2_Upravený'!C30)","v":"Klinická hodnocení - I. Interní klinika"},{"$f":"'2_Upravený'!D30-'1_Původní'!D30","v":0},{"$f":"'2_Upravený'!E30-'1_Původní'!E30","v":0},{"$f":"'2_Upravený'!F30-'1_Původní'!F30","v":0},{"$f":"'2_Upravený'!G30-'1_Původní'!G30","v":0},{"$f":"'2_Upravený'!H30-'1_Původní'!H30","v":0},{"$f":"'2_Upravený'!I30-'1_Původní'!I30","v":0},{"$f":"'2_Upravený'!J30-'1_Původní'!J30","v":0},{"$f":"'2_Upravený'!K30-'1_Původní'!K30","v":0},{"$f":"'2_Upravený'!L30-'1_Původní'!L30","v":0},{"$f":"'2_Upravený'!M30-'1_Původní'!M30","v":0},{"$f":"'2_Upravený'!N30-'1_Původní'!N30","v":0},{"$f":"'2_Upravený'!O30-'1_Původní'!O30","v":0},{"$f":"SUM(D30:O30)","v":0}]
[null,{"$f":"IF('2_Upravený'!B31=\"\",\"\",'2_Upravený'!B31)","v":"8103"},{"$f":"IF('2_Upravený'!C31=\"\",\"\",'2_Upravený'!C31)","v":"Klinická hodnocení - III. Interní klinika"},{"$f":"'2_Upravený'!D31-'1_Původní'!D31","v":0},{"$f":"'2_Upravený'!E31-'1_Původní'!E31","v":0},{"$f":"'2_Upravený'!F31-'1_Původní'!F31","v":0},{"$f":"'2_Upravený'!G31-'1_Původní'!G31","v":0},{"$f":"'2_Upravený'!H31-'1_Původní'!H31","v":0},{"$f":"'2_Upravený'!I31-'1_Původní'!I31","v":0},{"$f":"'2_Upravený'!J31-'1_Původní'!J31","v":0},{"$f":"'2_Upravený'!K31-'1_Původní'!K31","v":0},{"$f":"'2_Upravený'!L31-'1_Původní'!L31","v":0},{"$f":"'2_Upravený'!M31-'1_Původní'!M31","v":0},{"$f":"'2_Upravený'!N31-'1_Původní'!N31","v":0},{"$f":"'2_Upravený'!O31-'1_Původní'!O31","v":0},{"$f":"SUM(D31:O31)","v":0}]
[null,{"$f":"IF('2_Upravený'!B32=\"\",\"\",'2_Upravený'!B32)","v":"8105"},{"$f":"IF('2_Upravený'!C32=\"\",\"\",'2_Upravený'!C32)","v":"Klinická hodnocení - II. Chirurgická klinika"},{"$f":"'2_Upravený'!D32-'1_Původní'!D32","v":0},{"$f":"'2_Upravený'!E32-'1_Původní'!E32","v":0},{"$f":"'2_Upravený'!F32-'1_Původní'!F32","v":0},{"$f":"'2_Upravený'!G32-'1_Původní'!G32","v":0},{"$f":"'2_Upravený'!H32-'1_Původní'!H32","v":0},{"$f":"'2_Upravený'!I32-'1_Původní'!I32","v":0},{"$f":"'2_Upravený'!J32-'1_Původní'!J32","v":0},{"$f":"'2_Upravený'!K32-'1_Původní'!K32","v":0},{"$f":"'2_Upravený'!L32-'1_Původní'!L32","v":0},{"$f":"'2_Upravený'!M32-'1_Původní'!M32","v":0},{"$f":"'2_Upravený'!N32-'1_Původní'!N32","v":0},{"$f":"'2_Upravený'!O32-'1_Původní'!O32","v":0},0]
[null,{"$f":"IF('2_Upravený'!B33=\"\",\"\",'2_Upravený'!B33)","v":"8110"},{"$f":"IF('2_Upravený'!C33=\"\",\"\",'2_Upravený'!C33)","v":"Klinická hodnocení - Dětská klinika"},{"$f":"'2_Upravený'!D33-'1_Původní'!D33","v":0},{"$f":"'2_Upravený'!E33-'1_Původní'!E33","v":0},{"$f":"'2_Upravený'!F33-'1_Původní'!F33","v":0},{"$f":"'2_Upravený'!G33-'1_Původní'!G33","v":0},{"$f":"'2_Upravený'!H33-'1_Původní'!H33","v":0},{"$f":"'2_Upravený'!I33-'1_Původní'!I33","v":0},{"$f":"'2_Upravený'!J33-'1_Původní'!J33","v":0},{"$f":"'2_Upravený'!K33-'1_Původní'!K33","v":0},{"$f":"'2_Upravený'!L33-'1_Původní'!L33","v":0},{"$f":"'2_Upravený'!M33-'1_Původní'!M33","v":0},{"$f":"'2_Upravený'!N33-'1_Původní'!N33","v":0},{"$f":"'2_Upravený'!O33-'1_Původní'!O33","v":0},0]
[null,{"$f":"IF('2_Upravený'!B34=\"\",\"\",'2_Upravený'!B34)","v":"8112"},{"$f":"IF('2_Upravený'!C34=\"\",\"\",'2_Upravený'!C34)","v":"Klinická hodnocení - Urologická klinika"},{"$f":"'2_Upravený'!D34-'1_Původní'!D34","v":0},{"$f":"'2_Upravený'!E34-'1_Původní'!E34","v":0},{"$f":"'2_Upravený'!F34-'1_Původní'!F34","v":0},{"$f":"'2_Upravený'!G34-'1_Původní'!G34","v":0},{"$f":"'2_Upravený'!H34-'1_Původní'!H34","v":0},{"$f":"'2_Upravený'!I34-'1_Původní'!I34","v":0},{"$f":"'2_Upravený'!J34-'1_Původní'!J34","v":0},{"$f":"'2_Upravený'!K34-'1_Původní'!K34","v":0},{"$f":"'2_Upravený'!L34-'1_Původní'!L34","v":0},{"$f":"'2_Upravený'!M34-'1_Původní'!M34","v":0},{"$f":"'2_Upravený'!N34-'1_Původní'!N34","v":0},{"$f":"'2_Upravený'!O34-'1_Původní'!O34","v":0},0]
[null,{"$f":"IF('2_Upravený'!B35=\"\",\"\",'2_Upravený'!B35)","v":"8114"},{"$f":"IF('2_Upravený'!C35=\"\",\"\",'2_Upravený'!C35)","v":"Klinická hodnocení - Oční klinika"},{"$f":"'2_Upravený'!D35-'1_Původní'!D35","v":0},{"$f":"'2_Upravený'!E35-'1_Původní'!E35","v":0},{"$f":"'2_Upravený'!F35-'1_Původní'!F35","v":0},{"$f":"'2_Upravený'!G35-'1_Původní'!G35","v":0},{"$f":"'2_Upravený'!H35-'1_Původní'!H35","v":0},{"$f":"'2_Upravený'!I35-'1_Původní'!I35","v":0},{"$f":"'2_Upravený'!J35-'1_Původní'!J35","v":0},{"$f":"'2_Upravený'!K35-'1_Původní'!K35","v":0},{"$f":"'2_Upravený'!L35-'1_Původní'!L35","v":0},{"$f":"'2_Upravený'!M35-'1_Původní'!M35","v":0},{"$f":"'2_Upravený'!N35-'1_Původní'!N35","v":0},{"$f":"'2_Upravený'!O35-'1_Původní'!O35","v":0},0]
[null,{"$f":"IF('2_Upravený'!B36=\"\",\"\",'2_Upravený'!B36)","v":"8116"},{"$f":"IF('2_Upravený'!C36=\"\",\"\",'2_Upravený'!C36)","v":"Klinická hodnocení - Klinika plicních nemocí a tuberkulózy"},{"$f":"'2_Upravený'!D36-'1_Původní'!D36","v":0},{"$f":"'2_Upravený'!E36-'1_Původní'!E36","v":0},{"$f":"'2_Upravený'!F36-'1_Původní'!F36","v":0},{"$f":"'2_Upravený'!G36-'1_Původní'!G36","v":0},{"$f":"'2_Upravený'!H36-'1_Původní'!H36","v":0},{"$f":"'2_Upravený'!I36-'1_Původní'!I36","v":0},{"$f":"'2_Upravený'!J36-'1_Původní'!J36","v":0},{"$f":"'2_Upravený'!K36-'1_Původní'!K36","v":0},{"$f":"'2_Upravený'!L36-'1_Původní'!L36","v":0},{"$f":"'2_Upravený'!M36-'1_Původní'!M36","v":0},{"$f":"'2_Upravený'!N36-'1_Původní'!N36","v":0},{"$f":"'2_Upravený'!O36-'1_Původní'!O36","v":0},0]
[null,{"$f":"IF('2_Upravený'!B37=\"\",\"\",'2_Upravený'!B37)","v":"8117"},{"$f":"IF('2_Upravený'!C37=\"\",\"\",'2_Upravený'!C37)","v":"Klinická hodnocení - Neurologická klinika"},{"$f":"'2_Upravený'!D37-'1_Původní'!D37","v":0},{"$f":"'2_Upravený'!E37-'1_Původní'!E37","v":0},{"$f":"'2_Upravený'!F37-'1_Původní'!F37","v":0},{"$f":"'2_Upravený'!G37-'1_Původní'!G37","v":0},{"$f":"'2_Upravený'!H37-'1_Původní'!H37","v":0},{"$f":"'2_Upravený'!I37-'1_Původní'!I37","v":0},{"$f":"'2_Upravený'!J37-'1_Původní'!J37","v":0},{"$f":"'2_Upravený'!K37-'1_Původní'!K37","v":0},{"$f":"'2_Upravený'!L37-'1_Původní'!L37","v":0},{"$f":"'2_Upravený'!M37-'1_Původní'!M37","v":0},{"$f":"'2_Upravený'!N37-'1_Původní'!N37","v":0},{"$f":"'2_Upravený'!O37-'1_Původní'!O37","v":0},0]
[null,{"$f":"IF('2_Upravený'!B38=\"\",\"\",'2_Upravený'!B38)","v":"8121"},{"$f":"IF('2_Upravený'!C38=\"\",\"\",'2_Upravený'!C38)","v":"Klinická hodnocení - Onkologická klinika"},{"$f":"'2_Upravený'!D38-'1_Původní'!D38","v":0},{"$f":"'2_Upravený'!E38-'1_Původní'!E38","v":0},{"$f":"'2_Upravený'!F38-'1_Původní'!F38","v":0},{"$f":"'2_Upravený'!G38-'1_Původní'!G38","v":0},{"$f":"'2_Upravený'!H38-'1_Původní'!H38","v":0},{"$f":"'2_Upravený'!I38-'1_Původní'!I38","v":0},{"$f":"'2_Upravený'!J38-'1_Původní'!J38","v":0},{"$f":"'2_Upravený'!K38-'1_Původní'!K38","v":0},{"$f":"'2_Upravený'!L38-'1_Původní'!L38","v":0},{"$f":"'2_Upravený'!M38-'1_Původní'!M38","v":0},{"$f":"'2_Upravený'!N38-'1_Původní'!N38","v":0},{"$f":"'2_Upravený'!O38-'1_Původní'!O38","v":0},0]
[null,{"$f":"IF('2_Upravený'!B39=\"\",\"\",'2_Upravený'!B39)","v":"8132"},{"$f":"IF('2_Upravený'!C39=\"\",\"\",'2_Upravený'!C39)","v":"Klinická hodnocení - Hemato-onkologická klinika"},{"$f":"'2_Upravený'!D39-'1_Původní'!D39","v":163409.50169999999},{"$f":"'2_Upravený'!E39-'1_Původní'!E39","v":0},{"$f":"'2_Upravený'!F39-'1_Původní'!F39","v":0},{"$f":"'2_Upravený'!G39-'1_Původní'!G39","v":0},{"$f":"'2_Upravený'!H39-'1_Původní'!H39","v":0},{"$f":"'2_Upravený'!I39-'1_Původní'!I39","v":0},{"$f":"'2_Upravený'!J39-'1_Původní'!J39","v":0},{"$f":"'2_Upravený'!K39-'1_Původní'!K39","v":-163409.53080000001},{"$f":"'2_Upravený'!L39-'1_Původní'!L39","v":0},{"$f":"'2_Upravený'!M39-'1_Původní'!M39","v":0},{"$f":"'2_Upravený'!N39-'1_Původní'!N39","v":0},{"$f":"'2_Upravený'!O39-'1_Původní'!O39","v":0},-2.9100000014295802E-2]
[null,{"$f":"IF('2_Upravený'!B40=\"\",\"\",'2_Upravený'!B40)","v":"8148"},{"$f":"IF('2_Upravený'!C40=\"\",\"\",'2_Upravený'!C40)","v":"Klinická hodnocení - Lékárna"},{"$f":"'2_Upravený'!D40-'1_Původní'!D40","v":0},{"$f":"'2_Upravený'!E40-'1_Původní'!E40","v":0},{"$f":"'2_Upravený'!F40-'1_Původní'!F40","v":0},{"$f":"'2_Upravený'!G40-'1_Původní'!G40","v":0},{"$f":"'2_Upravený'!H40-'1_Původní'!H40","v":0},{"$f":"'2_Upravený'!I40-'1_Původní'!I40","v":0},{"$f":"'2_Upravený'!J40-'1_Původní'!J40","v":0},{"$f":"'2_Upravený'!K40-'1_Původní'!K40","v":0},{"$f":"'2_Upravený'!L40-'1_Původní'!L40","v":0},{"$f":"'2_Upravený'!M40-'1_Původní'!M40","v":0},{"$f":"'2_Upravený'!N40-'1_Původní'!N40","v":0},{"$f":"'2_Upravený'!O40-'1_Původní'!O40","v":0},0]
[null,{"$f":"IF('2_Upravený'!B41=\"\",\"\",'2_Upravený'!B41)","v":"9028"},{"$f":"IF('2_Upravený'!C41=\"\",\"\",'2_Upravený'!C41)","v":"Oddělení vědy a výzkumu"},{"$f":"'2_Upravený'!D41-'1_Původní'!D41","v":0},{"$f":"'2_Upravený'!E41-'1_Původní'!E41","v":0},{"$f":"'2_Upravený'!F41-'1_Původní'!F41","v":0},{"$f":"'2_Upravený'!G41-'1_Původní'!G41","v":0},{"$f":"'2_Upravený'!H41-'1_Původní'!H41","v":0},{"$f":"'2_Upravený'!I41-'1_Původní'!I41","v":0},{"$f":"'2_Upravený'!J41-'1_Původní'!J41","v":0},{"$f":"'2_Upravený'!K41-'1_Původní'!K41","v":0},{"$f":"'2_Upravený'!L41-'1_Původní'!L41","v":0},{"$f":"'2_Upravený'!M41-'1_Původní'!M41","v":0},{"$f":"'2_Upravený'!N41-'1_Původní'!N41","v":0},{"$f":"'2_Upravený'!O41-'1_Původní'!O41","v":0},0]
[null,{"$f":"IF('2_Upravený'!B42=\"\",\"\",'2_Upravený'!B42)","v":""},{"$f":"IF('2_Upravený'!C42=\"\",\"\",'2_Upravený'!C42)","v":""},{"$f":"'2_Upravený'!D42-'1_Původní'!D42","v":0},{"$f":"'2_Upravený'!E42-'1_Původní'!E42","v":0},{"$f":"'2_Upravený'!F42-'1_Původní'!F42","v":0},{"$f":"'2_Upravený'!G42-'1_Původní'!G42","v":0},{"$f":"'2_Upravený'!H42-'1_Původní'!H42","v":0},{"$f":"'2_Upravený'!I42-'1_Původní'!I42","v":0},{"$f":"'2_Upravený'!J42-'1_Původní'!J42","v":0},{"$f":"'2_Upravený'!K42-'1_Původní'!K42","v":0},{"$f":"'2_Upravený'!L42-'1_Původní'!L42","v":0},{"$f":"'2_Upravený'!M42-'1_Původní'!M42","v":0},{"$f":"'2_Upravený'!N42-'1_Původní'!N42","v":0},{"$f":"'2_Upravený'!O42-'1_Původní'!O42","v":0},0]
[]
[64924441,"Klinické hodnocení - 3.země (81xx,9003,9028)",null,{"$f":"SUM(D57:D57)","v":0},0,0,0,0,0,0,0,0,0,0,0,0]
[null,{"$f":"IF('2_Upravený'!B45=\"\",\"\",'2_Upravený'!B45)","v":"8101"},{"$f":"IF('2_Upravený'!C45=\"\",\"\",'2_Upravený'!C45)","v":"Klinická hodnocení - I. Interní klinika"},{"$f":"'2_Upravený'!D45-'1_Původní'!D45","v":0},{"$f":"'2_Upravený'!E45-'1_Původní'!E45","v":0},{"$f":"'2_Upravený'!F45-'1_Původní'!F45","v":0},{"$f":"'2_Upravený'!G45-'1_Původní'!G45","v":0},{"$f":"'2_Upravený'!H45-'1_Původní'!H45","v":0},{"$f":"'2_Upravený'!I45-'1_Původní'!I45","v":0},{"$f":"'2_Upravený'!J45-'1_Původní'!J45","v":0},{"$f":"'2_Upravený'!K45-'1_Původní'!K45","v":0},{"$f":"'2_Upravený'!L45-'1_Původní'!L45","v":0},{"$f":"'2_Upravený'!M45-'1_Původní'!M45","v":0},{"$f":"'2_Upravený'!N45-'1_Původní'!N45","v":0},{"$f":"'2_Upravený'!O45-'1_Původní'!O45","v":0},{"$f":"SUM(D45:O45)","v":0}]
[null,{"$f":"IF('2_Upravený'!B46=\"\",\"\",'2_Upravený'!B46)","v":"8103"},{"$f":"IF('2_Upravený'!C46=\"\",\"\",'2_Upravený'!C46)","v":"Klinická hodnocení - III. Interní klinika"},{"$f":"'2_Upravený'!D46-'1_Původní'!D46","v":0},{"$f":"'2_Upravený'!E46-'1_Původní'!E46","v":0},{"$f":"'2_Upravený'!F46-'1_Původní'!F46","v":0},{"$f":"'2_Upravený'!G46-'1_Původní'!G46","v":0},{"$f":"'2_Upravený'!H46-'1_Původní'!H46","v":0},{"$f":"'2_Upravený'!I46-'1_Původní'!I46","v":0},{"$f":"'2_Upravený'!J46-'1_Původní'!J46","v":0},{"$f":"'2_Upravený'!K46-'1_Původní'!K46","v":0},{"$f":"'2_Upravený'!L46-'1_Původní'!L46","v":0},{"$f":"'2_Upravený'!M46-'1_Původní'!M46","v":0},{"$f":"'2_Upravený'!N46-'1_Původní'!N46","v":0},{"$f":"'2_Upravený'!O46-'1_Původní'!O46","v":0},{"$f":"SUM(D46:O46)","v":0}]
[null,{"$f":"IF('2_Upravený'!B47=\"\",\"\",'2_Upravený'!B47)","v":"8108"},{"$f":"IF('2_Upravený'!C47=\"\",\"\",'2_Upravený'!C47)","v":"Klinická hodnocení - Porodnicko-gynekologická klinika"},{"$f":"'2_Upravený'!D47-'1_Původní'!D47","v":0},{"$f":"'2_Upravený'!E47-'1_Původní'!E47","v":0},{"$f":"'2_Upravený'!F47-'1_Původní'!F47","v":0},{"$f":"'2_Upravený'!G47-'1_Původní'!G47","v":0},{"$f":"'2_Upravený'!H47-'1_Původní'!H47","v":0},{"$f":"'2_Upravený'!I47-'1_Původní'!I47","v":0},{"$f":"'2_Upravený'!J47-'1_Původní'!J47","v":0},{"$f":"'2_Upravený'!K47-'1_Původní'!K47","v":0},{"$f":"'2_Upravený'!L47-'1_Původní'!L47","v":0},{"$f":"'2_Upravený'!M47-'1_Původní'!M47","v":0},{"$f":"'2_Upravený'!N47-'1_Původní'!N47","v":0},{"$f":"'2_Upravený'!O47-'1_Původní'!O47","v":0},0]
[null,{"$f":"IF('2_Upravený'!B48=\"\",\"\",'2_Upravený'!B48)","v":"8116"},{"$f":"IF('2_Upravený'!C48=\"\",\"\",'2_Upravený'!C48)","v":"Klinická hodnocení - Klinika plicních nemocí a tuberkulózy"},{"$f":"'2_Upravený'!D48-'1_Původní'!D48","v":0},{"$f":"'2_Upravený'!E48-'1_Původní'!E48","v":0},{"$f":"'2_Upravený'!F48-'1_Původní'!F48","v":0},{"$f":"'2_Upravený'!G48-'1_Původní'!G48","v":0},{"$f":"'2_Upravený'!H48-'1_Původní'!H48","v":0},{"$f":"'2_Upravený'!I48-'1_Původní'!I48","v":0},{"$f":"'2_Upravený'!J48-'1_Původní'!J48","v":0},{"$f":"'2_Upravený'!K48-'1_Původní'!K48","v":0},{"$f":"'2_Upravený'!L48-'1_Původní'!L48","v":0},{"$f":"'2_Upravený'!M48-'1_Původní'!M48","v":0},{"$f":"'2_Upravený'!N48-'1_Původní'!N48","v":0},{"$f":"'2_Upravený'!O48-'1_Původní'!O48","v":0},0]
[null,{"$f":"IF('2_Upravený'!B49=\"\",\"\",'2_Upravený'!B49)","v":"8117"},{"$f":"IF('2_Upravený'!C49=\"\",\"\",'2_Upravený'!C49)","v":"Klinická hodnocení - Neurologická klinika"},{"$f":"'2_Upravený'!D49-'1_Původní'!D49","v":0},{"$f":"'2_Upravený'!E49-'1_Původní'!E49","v":0},{"$f":"'2_Upravený'!F49-'1_Původní'!F49","v":0},{"$f":"'2_Upravený'!G49-'1_Původní'!G49","v":0},{"$f":"'2_Upravený'!H49-'1_Původní'!H49","v":0},{"$f":"'2_Upravený'!I49-'1_Původní'!I49","v":0},{"$f":"'2_Upravený'!J49-'1_Původní'!J49","v":0},{"$f":"'2_Upravený'!K49-'1_Původní'!K49","v":0},{"$f":"'2_Upravený'!L49-'1_Původní'!L49","v":0},{"$f":"'2_Upravený'!M49-'1_Původní'!M49","v":0},{"$f":"'2_Upravený'!N49-'1_Původní'!N49","v":0},{"$f":"'2_Upravený'!O49-'1_Původní'!O49","v":0},0]
[null,{"$f":"IF('2_Upravený'!B50=\"\",\"\",'2_Upravený'!B50)","v":"8120"},{"$f":"IF('2_Upravený'!C50=\"\",\"\",'2_Upravený'!C50)","v":"Klinická hodnocení - Klinika chorob kožních a pohlavních"},{"$f":"'2_Upravený'!D50-'1_Původní'!D50","v":0},{"$f":"'2_Upravený'!E50-'1_Původní'!E50","v":0},{"$f":"'2_Upravený'!F50-'1_Původní'!F50","v":0},{"$f":"'2_Upravený'!G50-'1_Původní'!G50","v":0},{"$f":"'2_Upravený'!H50-'1_Původní'!H50","v":0},{"$f":"'2_Upravený'!I50-'1_Původní'!I50","v":0},{"$f":"'2_Upravený'!J50-'1_Původní'!J50","v":0},{"$f":"'2_Upravený'!K50-'1_Původní'!K50","v":0},{"$f":"'2_Upravený'!L50-'1_Původní'!L50","v":0},{"$f":"'2_Upravený'!M50-'1_Původní'!M50","v":0},{"$f":"'2_Upravený'!N50-'1_Původní'!N50","v":0},{"$f":"'2_Upravený'!O50-'1_Původní'!O50","v":0},0]
[null,{"$f":"IF('2_Upravený'!B51=\"\",\"\",'2_Upravený'!B51)","v":"8121"},{"$f":"IF('2_Upravený'!C51=\"\",\"\",'2_Upravený'!C51)","v":"Klinická hodnocení - Onkologická klinika"},{"$f":"'2_Upravený'!D51-'1_Původní'!D51","v":0},{"$f":"'2_Upravený'!E51-'1_Původní'!E51","v":0},{"$f":"'2_Upravený'!F51-'1_Původní'!F51","v":0},{"$f":"'2_Upravený'!G51-'1_Původní'!G51","v":0},{"$f":"'2_Upravený'!H51-'1_Původní'!H51","v":0},{"$f":"'2_Upravený'!I51-'1_Původní'!I51","v":0},{"$f":"'2_Upravený'!J51-'1_Původní'!J51","v":0},{"$f":"'2_Upravený'!K51-'1_Původní'!K51","v":0},{"$f":"'2_Upravený'!L51-'1_Původní'!L51","v":0},{"$f":"'2_Upravený'!M51-'1_Původní'!M51","v":0},{"$f":"'2_Upravený'!N51-'1_Původní'!N51","v":0},{"$f":"'2_Upravený'!O51-'1_Původní'!O51","v":0},0]
[null,{"$f":"IF('2_Upravený'!B52=\"\",\"\",'2_Upravený'!B52)","v":"8132"},{"$f":"IF('2_Upravený'!C52=\"\",\"\",'2_Upravený'!C52)","v":"Klinická hodnocení - Hemato-onkologická klinika"},{"$f":"'2_Upravený'!D52-'1_Původní'!D52","v":0},{"$f":"'2_Upravený'!E52-'1_Původní'!E52","v":0},{"$f":"'2_Upravený'!F52-'1_Původní'!F52","v":0},{"$f":"'2_Upravený'!G52-'1_Původní'!G52","v":0},{"$f":"'2_Upravený'!H52-'1_Původní'!H52","v":0},{"$f":"'2_Upravený'!I52-'1_Původní'!I52","v":0},{"$f":"'2_Upravený'!J52-'1_Původní'!J52","v":0},{"$f":"'2_Upravený'!K52-'1_Původní'!K52","v":0},{"$f":"'2_Upravený'!L52-'1_Původní'!L52","v":0},{"$f":"'2_Upravený'!M52-'1_Původní'!M52","v":0},{"$f":"'2_Upravený'!N52-'1_Původní'!N52","v":0},{"$f":"'2_Upravený'!O52-'1_Původní'!O52","v":0},0]
[null,{"$f":"IF('2_Upravený'!B53=\"\",\"\",'2_Upravený'!B53)","v":"8134"},{"$f":"IF('2_Upravený'!C53=\"\",\"\",'2_Upravený'!C53)","v":"Klinická hodnocení - Radiologická klinika"},{"$f":"'2_Upravený'!D53-'1_Původní'!D53","v":0},{"$f":"'2_Upravený'!E53-'1_Původní'!E53","v":0},{"$f":"'2_Upravený'!F53-'1_Původní'!F53","v":0},{"$f":"'2_Upravený'!G53-'1_Původní'!G53","v":0},{"$f":"'2_Upravený'!H53-'1_Původní'!H53","v":0},{"$f":"'2_Upravený'!I53-'1_Původní'!I53","v":0},{"$f":"'2_Upravený'!J53-'1_Původní'!J53","v":0},{"$f":"'2_Upravený'!K53-'1_Původní'!K53","v":0},{"$f":"'2_Upravený'!L53-'1_Původní'!L53","v":0},{"$f":"'2_Upravený'!M53-'1_Původní'!M53","v":0},{"$f":"'2_Upravený'!N53-'1_Původní'!N53","v":0},{"$f":"'2_Upravený'!O53-'1_Původní'!O53","v":0},0]
[null,{"$f":"IF('2_Upravený'!B54=\"\",\"\",'2_Upravený'!B54)","v":"8148"},{"$f":"IF('2_Upravený'!C54=\"\",\"\",'2_Upravený'!C54)","v":"Klinická hodnocení - Lékárna"},{"$f":"'2_Upravený'!D54-'1_Původní'!D54","v":0},{"$f":"'2_Upravený'!E54-'1_Původní'!E54","v":0},{"$f":"'2_Upravený'!F54-'1_Původní'!F54","v":0},{"$f":"'2_Upravený'!G54-'1_Původní'!G54","v":0},{"$f":"'2_Upravený'!H54-'1_Původní'!H54","v":0},{"$f":"'2_Upravený'!I54-'1_Původní'!I54","v":0},{"$f":"'2_Upravený'!J54-'1_Původní'!J54","v":0},{"$f":"'2_Upravený'!K54-'1_Původní'!K54","v":0},{"$f":"'2_Upravený'!L54-'1_Původní'!L54","v":0},{"$f":"'2_Upravený'!M54-'1_Původní'!M54","v":0},{"$f":"'2_Upravený'!N54-'1_Původní'!N54","v":0},{"$f":"'2_Upravený'!O54-'1_Původní'!O54","v":0},0]
[null,{"$f":"IF('2_Upravený'!B55=\"\",\"\",'2_Upravený'!B55)","v":"8150"},{"$f":"IF('2_Upravený'!C55=\"\",\"\",'2_Upravený'!C55)","v":"Klinická hodnocení - Kardiochirurgická klinika"},{"$f":"'2_Upravený'!D55-'1_Původní'!D55","v":0},{"$f":"'2_Upravený'!E55-'1_Původní'!E55","v":0},{"$f":"'2_Upravený'!F55-'1_Původní'!F55","v":0},{"$f":"'2_Upravený'!G55-'1_Původní'!G55","v":0},{"$f":"'2_Upravený'!H55-'1_Původní'!H55","v":0},{"$f":"'2_Upravený'!I55-'1_Původní'!I55","v":0},{"$f":"'2_Upravený'!J55-'1_Původní'!J55","v":0},{"$f":"'2_Upravený'!K55-'1_Původní'!K55","v":0},{"$f":"'2_Upravený'!L55-'1_Původní'!L55","v":0},{"$f":"'2_Upravený'!M55-'1_Původní'!M55","v":0},{"$f":"'2_Upravený'!N55-'1_Původní'!N55","v":0},{"$f":"'2_Upravený'!O55-'1_Původní'!O55","v":0},0]
[null,{"$f":"IF('2_Upravený'!B56=\"\",\"\",'2_Upravený'!B56)","v":"9028"},{"$f":"IF('2_Upravený'!C56=\"\",\"\",'2_Upravený'!C56)","v":"Oddělení vědy a výzkumu"},{"$f":"'2_Upravený'!D56-'1_Původní'!D56","v":0},{"$f":"'2_Upravený'!E56-'1_Původní'!E56","v":0},{"$f":"'2_Upravený'!F56-'1_Původní'!F56","v":0},{"$f":"'2_Upravený'!G56-'1_Původní'!G56","v":0},{"$f":"'2_Upravený'!H56-'1_Původní'!H56","v":0},{"$f":"'2_Upravený'!I56-'1_Původní'!I56","v":0},{"$f":"'2_Upravený'!J56-'1_Původní'!J56","v":0},{"$f":"'2_Upravený'!K56-'1_Původní'!K56","v":0},{"$f":"'2_Upravený'!L56-'1_Původní'!L56","v":0},{"$f":"'2_Upravený'!M56-'1_Původní'!M56","v":0},{"$f":"'2_Upravený'!N56-'1_Původní'!N56","v":0},{"$f":"'2_Upravený'!O56-'1_Původní'!O56","v":0},0]
[null,{"$f":"IF('2_Upravený'!B57=\"\",\"\",'2_Upravený'!B57)","v":""},{"$f":"IF('2_Upravený'!C57=\"\",\"\",'2_Upravený'!C57)","v":""},{"$f":"'2_Upravený'!D57-'1_Původní'!D57","v":0},{"$f":"'2_Upravený'!E57-'1_Původní'!E57","v":0},{"$f":"'2_Upravený'!F57-'1_Původní'!F57","v":0},{"$f":"'2_Upravený'!G57-'1_Původní'!G57","v":0},{"$f":"'2_Upravený'!H57-'1_Původní'!H57","v":0},{"$f":"'2_Upravený'!I57-'1_Původní'!I57","v":0},{"$f":"'2_Upravený'!J57-'1_Původní'!J57","v":0},{"$f":"'2_Upravený'!K57-'1_Původní'!K57","v":0},{"$f":"'2_Upravený'!L57-'1_Původní'!L57","v":0},{"$f":"'2_Upravený'!M57-'1_Původní'!M57","v":0},{"$f":"'2_Upravený'!N57-'1_Původní'!N57","v":0},{"$f":"'2_Upravený'!O57-'1_Původní'!O57","v":0},0]
[]
[67101000,"Transfery MZ - ostatní",null,{"$f":"SUM(D77:D77)","v":0},0,0,0,0,0,0,0,0,0,0,0,0]
[null,{"$f":"IF('2_Upravený'!B60=\"\",\"\",'2_Upravený'!B60)","v":"0873"},{"$f":"IF('2_Upravený'!C60=\"\",\"\",'2_Upravený'!C60)","v":"IROP - Mod.obn.přístr.vyb.perinatologického centra"},{"$f":"'2_Upravený'!D60-'1_Původní'!D60","v":0},{"$f":"'2_Upravený'!E60-'1_Původní'!E60","v":0},{"$f":"'2_Upravený'!F60-'1_Původní'!F60","v":0},{"$f":"'2_Upravený'!G60-'1_Původní'!G60","v":0},{"$f":"'2_Upravený'!H60-'1_Původní'!H60","v":0},{"$f":"'2_Upravený'!I60-'1_Původní'!I60","v":0},{"$f":"'2_Upravený'!J60-'1_Původní'!J60","v":0},{"$f":"'2_Upravený'!K60-'1_Původní'!K60","v":0},{"$f":"'2_Upravený'!L60-'1_Původní'!L60","v":0},{"$f":"'2_Upravený'!M60-'1_Původní'!M60","v":0},{"$f":"'2_Upravený'!N60-'1_Původní'!N60","v":-8351.5115000000005},{"$f":"'2_Upravený'!O60-'1_Původní'!O60","v":0},{"$f":"SUM(D60:O60)","v":-8351.5115000000005}]
[null,{"$f":"IF('2_Upravený'!B61=\"\",\"\",'2_Upravený'!B61)","v":"1096"},{"$f":"IF('2_Upravený'!C61=\"\",\"\",'2_Upravený'!C61)","v":"OPVaVI - NPU I (projekt ÚMTM)"},{"$f":"'2_Upravený'!D61-'1_Původní'!D61","v":0},{"$f":"'2_Upravený'!E61-'1_Původní'!E61","v":0},{"$f":"'2_Upravený'!F61-'1_Původní'!F61","v":0},{"$f":"'2_Upravený'!G61-'1_Původní'!G61","v":-363532.63819999999},{"$f":"'2_Upravený'!H61-'1_Původní'!H61","v":-22340.820299999999},{"$f":"'2_Upravený'!I61-'1_Původní'!I61","v":0},{"$f":"'2_Upravený'!J61-'1_Původní'!J61","v":0},{"$f":"'2_Upravený'!K61-'1_Původní'!K61","v":0},{"$f":"'2_Upravený'!L61-'1_Původní'!L61","v":0},{"$f":"'2_Upravený'!M61-'1_Původní'!M61","v":0},{"$f":"'2_Upravený'!N61-'1_Původní'!N61","v":0},{"$f":"'2_Upravený'!O61-'1_Původní'!O61","v":0},{"$f":"SUM(D61:O61)","v":-385873.45850000001}]
[null,{"$f":"IF('2_Upravený'!B62=\"\",\"\",'2_Upravený'!B62)","v":"1704"},{"$f":"IF('2_Upravený'!C62=\"\",\"\",'2_Upravený'!C62)","v":"OP VVV - Molekulární, buněčný a klinický přístup ke zdravému stárnutí"},{"$f":"'2_Upravený'!D62-'1_Původní'!D62","v":1210000},{"$f":"'2_Upravený'!E62-'1_Původní'!E62","v":1210000},{"$f":"'2_Upravený'!F62-'1_Původní'!F62","v":1210000},{"$f":"'2_Upravený'!G62-'1_Původní'!G62","v":1210000},{"$f":"'2_Upravený'!H62-'1_Původní'!H62","v":1210000},{"$f":"'2_Upravený'!I62-'1_Původní'!I62","v":1210000},{"$f":"'2_Upravený'!J62-'1_Původní'!J62","v":1210000},{"$f":"'2_Upravený'!K62-'1_Původní'!K62","v":1210000},{"$f":"'2_Upravený'!L62-'1_Původní'!L62","v":-4262207.9249},{"$f":"'2_Upravený'!M62-'1_Původní'!M62","v":1210000},{"$f":"'2_Upravený'!N62-'1_Původní'!N62","v":1210000},{"$f":"'2_Upravený'!O62-'1_Původní'!O62","v":-1022328.9859000002},6815463.0891999993]
[null,{"$f":"IF('2_Upravený'!B63=\"\",\"\",'2_Upravený'!B63)","v":"2103"},{"$f":"IF('2_Upravený'!C63=\"\",\"\",'2_Upravený'!C63)","v":"Národní onkologický registr - NOR"},{"$f":"'2_Upravený'!D63-'1_Původní'!D63","v":0},{"$f":"'2_Upravený'!E63-'1_Původní'!E63","v":0},{"$f":"'2_Upravený'!F63-'1_Původní'!F63","v":0},{"$f":"'2_Upravený'!G63-'1_Původní'!G63","v":0},{"$f":"'2_Upravený'!H63-'1_Původní'!H63","v":0},{"$f":"'2_Upravený'!I63-'1_Původní'!I63","v":0},{"$f":"'2_Upravený'!J63-'1_Původní'!J63","v":0},{"$f":"'2_Upravený'!K63-'1_Původní'!K63","v":-602379.9105},{"$f":"'2_Upravený'!L63-'1_Původní'!L63","v":0},{"$f":"'2_Upravený'!M63-'1_Původní'!M63","v":0},{"$f":"'2_Upravený'!N63-'1_Původní'!N63","v":0},{"$f":"'2_Upravený'!O63-'1_Původní'!O63","v":0},-602379.9105]
[null,{"$f":"IF('2_Upravený'!B64=\"\",\"\",'2_Upravený'!B64)","v":"3203"},{"$f":"IF('2_Upravený'!C64=\"\",\"\",'2_Upravený'!C64)","v":"HOK: OPŽP - Novostavba pavilonu HOK"},{"$f":"'2_Upravený'!D64-'1_Původní'!D64","v":0},{"$f":"'2_Upravený'!E64-'1_Původní'!E64","v":0},{"$f":"'2_Upravený'!F64-'1_Původní'!F64","v":0},{"$f":"'2_Upravený'!G64-'1_Původní'!G64","v":0},{"$f":"'2_Upravený'!H64-'1_Původní'!H64","v":0},{"$f":"'2_Upravený'!I64-'1_Původní'!I64","v":0},{"$f":"'2_Upravený'!J64-'1_Původní'!J64","v":0},{"$f":"'2_Upravený'!K64-'1_Původní'!K64","v":-6469.8348999999998},{"$f":"'2_Upravený'!L64-'1_Původní'!L64","v":0},{"$f":"'2_Upravený'!M64-'1_Původní'!M64","v":0},{"$f":"'2_Upravený'!N64-'1_Původní'!N64","v":0},{"$f":"'2_Upravený'!O64-'1_Původní'!O64","v":0},-6469.8348999999998]
[null,{"$f":"IF('2_Upravený'!B65=\"\",\"\",'2_Upravený'!B65)","v":"3396"},{"$f":"IF('2_Upravený'!C65=\"\",\"\",'2_Upravený'!C65)","v":"OPVaVI - NPU I (projekt ÚMTM)"},{"$f":"'2_Upravený'!D65-'1_Původní'!D65","v":0},{"$f":"'2_Upravený'!E65-'1_Původní'!E65","v":0},{"$f":"'2_Upravený'!F65-'1_Původní'!F65","v":0},{"$f":"'2_Upravený'!G65-'1_Původní'!G65","v":-2160839.1675999998},{"$f":"'2_Upravený'!H65-'1_Původní'!H65","v":-3708.6916999999999},{"$f":"'2_Upravený'!I65-'1_Původní'!I65","v":0},{"$f":"'2_Upravený'!J65-'1_Původní'!J65","v":0},{"$f":"'2_Upravený'!K65-'1_Původní'!K65","v":0},{"$f":"'2_Upravený'!L65-'1_Původní'!L65","v":0},{"$f":"'2_Upravený'!M65-'1_Původní'!M65","v":0},{"$f":"'2_Upravený'!N65-'1_Původní'!N65","v":0},{"$f":"'2_Upravený'!O65-'1_Původní'!O65","v":0},-2164547.8592999997]
[null,{"$f":"IF('2_Upravený'!B66=\"\",\"\",'2_Upravený'!B66)","v":"3503"},{"$f":"IF('2_Upravený'!C66=\"\",\"\",'2_Upravený'!C66)","v":"TO - krizová připravenost"},{"$f":"'2_Upravený'!D66-'1_Původní'!D66","v":0},{"$f":"'2_Upravený'!E66-'1_Původní'!E66","v":0},{"$f":"'2_Upravený'!F66-'1_Původní'!F66","v":0},{"$f":"'2_Upravený'!G66-'1_Původní'!G66","v":0},{"$f":"'2_Upravený'!H66-'1_Původní'!H66","v":0},{"$f":"'2_Upravený'!I66-'1_Původní'!I66","v":0},{"$f":"'2_Upravený'!J66-'1_Původní'!J66","v":-142080.00579999998},{"$f":"'2_Upravený'!K66-'1_Původní'!K66","v":0},{"$f":"'2_Upravený'!L66-'1_Původní'!L66","v":0},{"$f":"'2_Upravený'!M66-'1_Původní'!M66","v":0},{"$f":"'2_Upravený'!N66-'1_Původní'!N66","v":0},{"$f":"'2_Upravený'!O66-'1_Původní'!O66","v":0},-142080.00579999998]
[null,{"$f":"IF('2_Upravený'!B67=\"\",\"\",'2_Upravený'!B67)","v":"4496"},{"$f":"IF('2_Upravený'!C67=\"\",\"\",'2_Upravený'!C67)","v":"OPVaVI - NPU I (projekt ÚMTM)"},{"$f":"'2_Upravený'!D67-'1_Původní'!D67","v":0},{"$f":"'2_Upravený'!E67-'1_Původní'!E67","v":0},{"$f":"'2_Upravený'!F67-'1_Původní'!F67","v":0},{"$f":"'2_Upravený'!G67-'1_Původní'!G67","v":-914016.24699999997},{"$f":"'2_Upravený'!H67-'1_Původní'!H67","v":26049.511999999999},{"$f":"'2_Upravený'!I67-'1_Původní'!I67","v":0},{"$f":"'2_Upravený'!J67-'1_Původní'!J67","v":0},{"$f":"'2_Upravený'!K67-'1_Původní'!K67","v":0},{"$f":"'2_Upravený'!L67-'1_Původní'!L67","v":0},{"$f":"'2_Upravený'!M67-'1_Původní'!M67","v":0},{"$f":"'2_Upravený'!N67-'1_Původní'!N67","v":0},{"$f":"'2_Upravený'!O67-'1_Původní'!O67","v":0},-887966.73499999999]
[null,{"$f":"IF('2_Upravený'!B68=\"\",\"\",'2_Upravený'!B68)","v":"5102"},{"$f":"IF('2_Upravený'!C68=\"\",\"\",'2_Upravený'!C68)","v":"NTMC - Národní telemedicínské centrum - provoz"},{"$f":"'2_Upravený'!D68-'1_Původní'!D68","v":0},{"$f":"'2_Upravený'!E68-'1_Původní'!E68","v":0},{"$f":"'2_Upravený'!F68-'1_Původní'!F68","v":0},{"$f":"'2_Upravený'!G68-'1_Původní'!G68","v":0},{"$f":"'2_Upravený'!H68-'1_Původní'!H68","v":0},{"$f":"'2_Upravený'!I68-'1_Původní'!I68","v":0},{"$f":"'2_Upravený'!J68-'1_Původní'!J68","v":0},{"$f":"'2_Upravený'!K68-'1_Původní'!K68","v":0},{"$f":"'2_Upravený'!L68-'1_Původní'!L68","v":0},{"$f":"'2_Upravený'!M68-'1_Původní'!M68","v":-604224.27540000004},{"$f":"'2_Upravený'!N68-'1_Původní'!N68","v":0},{"$f":"'2_Upravený'!O68-'1_Původní'!O68","v":0},-604224.27540000004]
[null,{"$f":"IF('2_Upravený'!B69=\"\",\"\",'2_Upravený'!B69)","v":"5106"},{"$f":"IF('2_Upravený'!C69=\"\",\"\",'2_Upravený'!C69)","v":"NTMC: SHAPES"},{"$f":"'2_Upravený'!D69-'1_Původní'!D69","v":0},{"$f":"'2_Upravený'!E69-'1_Původní'!E69","v":0},{"$f":"'2_Upravený'!F69-'1_Původní'!F69","v":0},{"$f":"'2_Upravený'!G69-'1_Původní'!G69","v":0},{"$f":"'2_Upravený'!H69-'1_Původní'!H69","v":0},{"$f":"'2_Upravený'!I69-'1_Původní'!I69","v":0},{"$f":"'2_Upravený'!J69-'1_Původní'!J69","v":0},{"$f":"'2_Upravený'!K69-'1_Původní'!K69","v":0},{"$f":"'2_Upravený'!L69-'1_Původní'!L69","v":0},{"$f":"'2_Upravený'!M69-'1_Původní'!M69","v":0},{"$f":"'2_Upravený'!N69-'1_Původní'!N69","v":0},{"$f":"'2_Upravený'!O69-'1_Původní'!O69","v":-51769.683199999999},-51769.683199999999]
[null,{"$f":"IF('2_Upravený'!B70=\"\",\"\",'2_Upravený'!B70)","v":"9029"},{"$f":"IF('2_Upravený'!C70=\"\",\"\",'2_Upravený'!C70)","v":"Paliativní péče"},{"$f":"'2_Upravený'!D70-'1_Původní'!D70","v":235000},{"$f":"'2_Upravený'!E70-'1_Původní'!E70","v":235000},{"$f":"'2_Upravený'!F70-'1_Původní'!F70","v":0},{"$f":"'2_Upravený'!G70-'1_Původní'!G70","v":0},{"$f":"'2_Upravený'!H70-'1_Původní'!H70","v":0},{"$f":"'2_Upravený'!I70-'1_Původní'!I70","v":0},{"$f":"'2_Upravený'!J70-'1_Původní'!J70","v":0},{"$f":"'2_Upravený'!K70-'1_Původní'!K70","v":-4029007.1197000002},{"$f":"'2_Upravený'!L70-'1_Původní'!L70","v":0},{"$f":"'2_Upravený'!M70-'1_Původní'!M70","v":0},{"$f":"'2_Upravený'!N70-'1_Původní'!N70","v":0},{"$f":"'2_Upravený'!O70-'1_Původní'!O70","v":1397640.9227},-2161366.1970000002]
[null,{"$f":"IF('2_Upravený'!B71=\"\",\"\",'2_Upravený'!B71)","v":"9151"},{"$f":"IF('2_Upravený'!C71=\"\",\"\",'2_Upravený'!C71)","v":"MA FNOL: Běh za zdraví"},{"$f":"'2_Upravený'!D71-'1_Původní'!D71","v":0},{"$f":"'2_Upravený'!E71-'1_Původní'!E71","v":0},{"$f":"'2_Upravený'!F71-'1_Původní'!F71","v":0},{"$f":"'2_Upravený'!G71-'1_Původní'!G71","v":0},{"$f":"'2_Upravený'!H71-'1_Původní'!H71","v":0},{"$f":"'2_Upravený'!I71-'1_Původní'!I71","v":0},{"$f":"'2_Upravený'!J71-'1_Původní'!J71","v":0},{"$f":"'2_Upravený'!K71-'1_Původní'!K71","v":-131804.87539999999},{"$f":"'2_Upravený'!L71-'1_Původní'!L71","v":0},{"$f":"'2_Upravený'!M71-'1_Původní'!M71","v":0},{"$f":"'2_Upravený'!N71-'1_Původní'!N71","v":0},{"$f":"'2_Upravený'!O71-'1_Původní'!O71","v":0},-131804.87539999999]
[null,{"$f":"IF('2_Upravený'!B72=\"\",\"\",'2_Upravený'!B72)","v":"9801"},{"$f":"IF('2_Upravený'!C72=\"\",\"\",'2_Upravený'!C72)","v":"Krizová připravenost - MZ"},{"$f":"'2_Upravený'!D72-'1_Původní'!D72","v":0},{"$f":"'2_Upravený'!E72-'1_Původní'!E72","v":0},{"$f":"'2_Upravený'!F72-'1_Původní'!F72","v":0},{"$f":"'2_Upravený'!G72-'1_Původní'!G72","v":0},{"$f":"'2_Upravený'!H72-'1_Původní'!H72","v":0},{"$f":"'2_Upravený'!I72-'1_Původní'!I72","v":0},{"$f":"'2_Upravený'!J72-'1_Původní'!J72","v":-551597.25410000002},{"$f":"'2_Upravený'!K72-'1_Původní'!K72","v":0},{"$f":"'2_Upravený'!L72-'1_Původní'!L72","v":0},{"$f":"'2_Upravený'!M72-'1_Původní'!M72","v":0},{"$f":"'2_Upravený'!N72-'1_Původní'!N72","v":0},{"$f":"'2_Upravený'!O72-'1_Původní'!O72","v":53805.205600000001},-497792.04850000003]
[null,{"$f":"IF('2_Upravený'!B73=\"\",\"\",'2_Upravený'!B73)","v":"9819"},{"$f":"IF('2_Upravený'!C73=\"\",\"\",'2_Upravený'!C73)","v":"TranMZČR: Bezpečnost a kvalita zdravotní péče"},{"$f":"'2_Upravený'!D73-'1_Původní'!D73","v":0},{"$f":"'2_Upravený'!E73-'1_Původní'!E73","v":0},{"$f":"'2_Upravený'!F73-'1_Původní'!F73","v":0},{"$f":"'2_Upravený'!G73-'1_Původní'!G73","v":0},{"$f":"'2_Upravený'!H73-'1_Původní'!H73","v":0},{"$f":"'2_Upravený'!I73-'1_Původní'!I73","v":0},{"$f":"'2_Upravený'!J73-'1_Původní'!J73","v":0},{"$f":"'2_Upravený'!K73-'1_Původní'!K73","v":-128836.6942},{"$f":"'2_Upravený'!L73-'1_Původní'!L73","v":0},{"$f":"'2_Upravený'!M73-'1_Původní'!M73","v":0},{"$f":"'2_Upravený'!N73-'1_Původní'!N73","v":0},{"$f":"'2_Upravený'!O73-'1_Původní'!O73","v":0},-128836.6942]
[null,{"$f":"IF('2_Upravený'!B74=\"\",\"\",'2_Upravený'!B74)","v":"5110"},{"$f":"IF('2_Upravený'!C74=\"\",\"\",'2_Upravený'!C74)","v":"NTMC: Projekt X"},{"$f":"'2_Upravený'!D74-'1_Původní'!D74","v":79833.333333333328},{"$f":"'2_Upravený'!E74-'1_Původní'!E74","v":79833.333333333328},{"$f":"'2_Upravený'!F74-'1_Původní'!F74","v":79833.333333333328},{"$f":"'2_Upravený'!G74-'1_Původní'!G74","v":79833.333333333328},{"$f":"'2_Upravený'!H74-'1_Původní'!H74","v":79833.333333333328},{"$f":"'2_Upravený'!I74-'1_Původní'!I74","v":79833.333333333328},{"$f":"'2_Upravený'!J74-'1_Původní'!J74","v":79833.333333333328},{"$f":"'2_Upravený'!K74-'1_Původní'!K74","v":79833.333333333328},{"$f":"'2_Upravený'!L74-'1_Původní'!L74","v":79833.333333333328},{"$f":"'2_Upravený'!M74-'1_Původní'!M74","v":79833.333333333328},{"$f":"'2_Upravený'!N74-'1_Původní'!N74","v":79833.333333333328},{"$f":"'2_Upravený'!O74-'1_Původní'!O74","v":79833.333333333328},958000.00000000012]
[null,{"$f":"IF('2_Upravený'!B75=\"\",\"\",'2_Upravený'!B75)","v":""},{"$f":"IF('2_Upravený'!C75=\"\",\"\",'2_Upravený'!C75)","v":""},{"$f":"'2_Upravený'!D75-'1_Původní'!D75","v":0},{"$f":"'2_Upravený'!E75-'1_Původní'!E75","v":0},{"$f":"'2_Upravený'!F75-'1_Původní'!F75","v":0},{"$f":"'2_Upravený'!G75-'1_Původní'!G75","v":0},{"$f":"'2_Upravený'!H75-'1_Původní'!H75","v":0},{"$f":"'2_Upravený'!I75-'1_Původní'!I75","v":0},{"$f":"'2_Upravený'!J75-'1_Původní'!J75","v":0},{"$f":"'2_Upravený'!K75-'1_Původní'!K75","v":0},{"$f":"'2_Upravený'!L75-'1_Původní'!L75","v":0},{"$f":"'2_Upravený'!M75-'1_Původní'!M75","v":0},{"$f":"'2_Upravený'!N75-'1_Původní'!N75","v":0},{"$f":"'2_Upravený'!O75-'1_Původní'!O75","v":0},0]
[null,{"$f":"IF('2_Upravený'!B76=\"\",\"\",'2_Upravený'!B76)","v":""},{"$f":"IF('2_Upravený'!C76=\"\",\"\",'2_Upravený'!C76)","v":""},{"$f":"'2_Upravený'!D76-'1_Původní'!D76","v":0},{"$f":"'2_Upravený'!E76-'1_Původní'!E76","v":0},{"$f":"'2_Upravený'!F76-'1_Původní'!F76","v":0},{"$f":"'2_Upravený'!G76-'1_Původní'!G76","v":0},{"$f":"'2_Upravený'!H76-'1_Původní'!H76","v":0},{"$f":"'2_Upravený'!I76-'1_Původní'!I76","v":0},{"$f":"'2_Upravený'!J76-'1_Původní'!J76","v":0},{"$f":"'2_Upravený'!K76-'1_Původní'!K76","v":0},{"$f":"'2_Upravený'!L76-'1_Původní'!L76","v":0},{"$f":"'2_Upravený'!M76-'1_Původní'!M76","v":0},{"$f":"'2_Upravený'!N76-'1_Původní'!N76","v":0},{"$f":"'2_Upravený'!O76-'1_Původní'!O76","v":0},0]
[null,{"$f":"IF('2_Upravený'!B77=\"\",\"\",'2_Upravený'!B77)","v":""},{"$f":"IF('2_Upravený'!C77=\"\",\"\",'2_Upravený'!C77)","v":""},{"$f":"'2_Upravený'!D77-'1_Původní'!D77","v":0},{"$f":"'2_Upravený'!E77-'1_Původní'!E77","v":0},{"$f":"'2_Upravený'!F77-'1_Původní'!F77","v":0},{"$f":"'2_Upravený'!G77-'1_Původní'!G77","v":0},{"$f":"'2_Upravený'!H77-'1_Původní'!H77","v":0},{"$f":"'2_Upravený'!I77-'1_Původní'!I77","v":0},{"$f":"'2_Upravený'!J77-'1_Původní'!J77","v":0},{"$f":"'2_Upravený'!K77-'1_Původní'!K77","v":0},{"$f":"'2_Upravený'!L77-'1_Původní'!L77","v":0},{"$f":"'2_Upravený'!M77-'1_Původní'!M77","v":0},{"$f":"'2_Upravený'!N77-'1_Původní'!N77","v":0},{"$f":"'2_Upravený'!O77-'1_Původní'!O77","v":0},0]
[]
[67101001,"Transfery MZ na VaV - věcné náklady",null,{"$f":"SUM(D91:D91)","v":0},0,0,0,0,0,0,0,0,0,0,0,0]
[null,{"$f":"IF('2_Upravený'!B80=\"\",\"\",'2_Upravený'!B80)","v":"8508"},{"$f":"IF('2_Upravený'!C80=\"\",\"\",'2_Upravený'!C80)","v":"Prof. MUDr. Miloš Táborský, CSc., FESC, MBA - I.IK"},{"$f":"'2_Upravený'!D80-'1_Původní'!D80","v":0},{"$f":"'2_Upravený'!E80-'1_Původní'!E80","v":0},{"$f":"'2_Upravený'!F80-'1_Původní'!F80","v":0},{"$f":"'2_Upravený'!G80-'1_Původní'!G80","v":0},{"$f":"'2_Upravený'!H80-'1_Původní'!H80","v":0},{"$f":"'2_Upravený'!I80-'1_Původní'!I80","v":0},{"$f":"'2_Upravený'!J80-'1_Původní'!J80","v":-478607.75900000002},{"$f":"'2_Upravený'!K80-'1_Původní'!K80","v":0},{"$f":"'2_Upravený'!L80-'1_Původní'!L80","v":0},{"$f":"'2_Upravený'!M80-'1_Původní'!M80","v":366816.16570000001},{"$f":"'2_Upravený'!N80-'1_Původní'!N80","v":0},{"$f":"'2_Upravený'!O80-'1_Původní'!O80","v":0},{"$f":"SUM(D80:O80)","v":-111791.59330000001}]
[null,{"$f":"IF('2_Upravený'!B81=\"\",\"\",'2_Upravený'!B81)","v":"8509"},{"$f":"IF('2_Upravený'!C81=\"\",\"\",'2_Upravený'!C81)","v":"Doc. MUDr. Daniel Šaňák, PhD. - NEUROL"},{"$f":"'2_Upravený'!D81-'1_Původní'!D81","v":0},{"$f":"'2_Upravený'!E81-'1_Původní'!E81","v":0},{"$f":"'2_Upravený'!F81-'1_Původní'!F81","v":0},{"$f":"'2_Upravený'!G81-'1_Původní'!G81","v":0},{"$f":"'2_Upravený'!H81-'1_Původní'!H81","v":0},{"$f":"'2_Upravený'!I81-'1_Původní'!I81","v":0},{"$f":"'2_Upravený'!J81-'1_Původní'!J81","v":-974682.95449999999},{"$f":"'2_Upravený'!K81-'1_Původní'!K81","v":{"$error":"#VALUE!"}},{"$f":"'2_Upravený'!L81-'1_Původní'!L81","v":0},{"$f":"'2_Upravený'!M81-'1_Původní'!M81","v":0},{"$f":"'2_Upravený'!N81-'1_Původní'!N81","v":0},{"$f":"'2_Upravený'!O81-'1_Původní'!O81","v":159077.74299999999},{"$f":"SUM(D81:O81)","v":{"$error":"#VALUE!"}}]
[null,{"$f":"IF('2_Upravený'!B82=\"\",\"\",'2_Upravený'!B82)","v":"8510"},{"$f":"IF('2_Upravený'!C82=\"\",\"\",'2_Upravený'!C82)","v":"Doc. MUDr. Petr Hamal, PhD. - MIKRO"},{"$f":"'2_Upravený'!D82-'1_Původní'!D82","v":0},{"$f":"'2_Upravený'!E82-'1_Původní'!E82","v":0},{"$f":"'2_Upravený'!F82-'1_Původní'!F82","v":0},{"$f":"'2_Upravený'!G82-'1_Původní'!G82","v":0},{"$f":"'2_Upravený'!H82-'1_Původní'!H82","v":0},{"$f":"'2_Upravený'!I82-'1_Původní'!I82","v":0},{"$f":"'2_Upravený'!J82-'1_Původní'!J82","v":-403497.78220000002},{"$f":"'2_Upravený'!K82-'1_Původní'!K82","v":0},{"$f":"'2_Upravený'!L82-'1_Původní'!L82","v":0},{"$f":"'2_Upravený'!M82-'1_Původní'!M82","v":0},{"$f":"'2_Upravený'!N82-'1_Původní'!N82","v":0},{"$f":"'2_Upravený'!O82-'1_Původní'!O82","v":12653.3586},-390844.42360000004]
[null,{"$f":"IF('2_Upravený'!B83=\"\",\"\",'2_Upravený'!B83)","v":"8511"},{"$f":"IF('2_Upravený'!C83=\"\",\"\",'2_Upravený'!C83)","v":"Prof. MUDr. Radovan Pilka, PhD. - PORGYN"},{"$f":"'2_Upravený'!D83-'1_Původní'!D83","v":0},{"$f":"'2_Upravený'!E83-'1_Původní'!E83","v":0},{"$f":"'2_Upravený'!F83-'1_Původní'!F83","v":0},{"$f":"'2_Upravený'!G83-'1_Původní'!G83","v":-707431.17660000001},{"$f":"'2_Upravený'!H83-'1_Původní'!H83","v":0},{"$f":"'2_Upravený'!I83-'1_Původní'!I83","v":405000},{"$f":"'2_Upravený'!J83-'1_Původní'!J83","v":0},{"$f":"'2_Upravený'!K83-'1_Původní'!K83","v":0},{"$f":"'2_Upravený'!L83-'1_Původní'!L83","v":0},{"$f":"'2_Upravený'!M83-'1_Původní'!M83","v":0},{"$f":"'2_Upravený'!N83-'1_Původní'!N83","v":0},{"$f":"'2_Upravený'!O83-'1_Původní'!O83","v":89781.348299999998},-212649.82829999999]
[null,{"$f":"IF('2_Upravený'!B84=\"\",\"\",'2_Upravený'!B84)","v":"8512"},{"$f":"IF('2_Upravený'!C84=\"\",\"\",'2_Upravený'!C84)","v":"Grant: MUDr. Martin Loveček, PhD. - I. CHIR"},{"$f":"'2_Upravený'!D84-'1_Původní'!D84","v":0},{"$f":"'2_Upravený'!E84-'1_Původní'!E84","v":0},{"$f":"'2_Upravený'!F84-'1_Původní'!F84","v":0},{"$f":"'2_Upravený'!G84-'1_Původní'!G84","v":0},{"$f":"'2_Upravený'!H84-'1_Původní'!H84","v":213000},{"$f":"'2_Upravený'!I84-'1_Původní'!I84","v":-164193.90270000001},{"$f":"'2_Upravený'!J84-'1_Původní'!J84","v":0},{"$f":"'2_Upravený'!K84-'1_Původní'!K84","v":0},{"$f":"'2_Upravený'!L84-'1_Původní'!L84","v":0},{"$f":"'2_Upravený'!M84-'1_Původní'!M84","v":0},{"$f":"'2_Upravený'!N84-'1_Původní'!N84","v":0},{"$f":"'2_Upravený'!O84-'1_Původní'!O84","v":18985.705999999998},67791.8033]
[null,{"$f":"IF('2_Upravený'!B85=\"\",\"\",'2_Upravený'!B85)","v":"8513"},{"$f":"IF('2_Upravený'!C85=\"\",\"\",'2_Upravený'!C85)","v":"Grant: MUDr. Martin Šín, PhD., FEBO - OČNÍ"},{"$f":"'2_Upravený'!D85-'1_Původní'!D85","v":0},{"$f":"'2_Upravený'!E85-'1_Původní'!E85","v":0},{"$f":"'2_Upravený'!F85-'1_Původní'!F85","v":0},{"$f":"'2_Upravený'!G85-'1_Původní'!G85","v":0},{"$f":"'2_Upravený'!H85-'1_Původní'!H85","v":354000},{"$f":"'2_Upravený'!I85-'1_Původní'!I85","v":-534503.55570000003},{"$f":"'2_Upravený'!J85-'1_Původní'!J85","v":0},{"$f":"'2_Upravený'!K85-'1_Původní'!K85","v":0},{"$f":"'2_Upravený'!L85-'1_Původní'!L85","v":0},{"$f":"'2_Upravený'!M85-'1_Původní'!M85","v":0},{"$f":"'2_Upravený'!N85-'1_Původní'!N85","v":0},{"$f":"'2_Upravený'!O85-'1_Původní'!O85","v":134360.90119999999},-46142.654500000033]
[null,{"$f":"IF('2_Upravený'!B86=\"\",\"\",'2_Upravený'!B86)","v":"8514"},{"$f":"IF('2_Upravený'!C86=\"\",\"\",'2_Upravený'!C86)","v":"Grant: Doc. MUDr. Miroslav Vaverka, CSc. - NEUROCH"},{"$f":"'2_Upravený'!D86-'1_Původní'!D86","v":0},{"$f":"'2_Upravený'!E86-'1_Původní'!E86","v":0},{"$f":"'2_Upravený'!F86-'1_Původní'!F86","v":0},{"$f":"'2_Upravený'!G86-'1_Původní'!G86","v":0},{"$f":"'2_Upravený'!H86-'1_Původní'!H86","v":0},{"$f":"'2_Upravený'!I86-'1_Původní'!I86","v":-79588.960100000026},{"$f":"'2_Upravený'!J86-'1_Původní'!J86","v":0},{"$f":"'2_Upravený'!K86-'1_Původní'!K86","v":0},{"$f":"'2_Upravený'!L86-'1_Původní'!L86","v":0},{"$f":"'2_Upravený'!M86-'1_Původní'!M86","v":0},{"$f":"'2_Upravený'!N86-'1_Původní'!N86","v":0},{"$f":"'2_Upravený'!O86-'1_Původní'!O86","v":6830.8680999999997},-72758.092000000033]
[null,{"$f":"IF('2_Upravený'!B87=\"\",\"\",'2_Upravený'!B87)","v":"8515"},{"$f":"IF('2_Upravený'!C87=\"\",\"\",'2_Upravený'!C87)","v":"Grant: Doc. Dr. Ing. Eva Kriegová - IMUNO"},{"$f":"'2_Upravený'!D87-'1_Původní'!D87","v":0},{"$f":"'2_Upravený'!E87-'1_Původní'!E87","v":0},{"$f":"'2_Upravený'!F87-'1_Původní'!F87","v":0},{"$f":"'2_Upravený'!G87-'1_Původní'!G87","v":0},{"$f":"'2_Upravený'!H87-'1_Původní'!H87","v":300000},{"$f":"'2_Upravený'!I87-'1_Původní'!I87","v":0},{"$f":"'2_Upravený'!J87-'1_Původní'!J87","v":0},{"$f":"'2_Upravený'!K87-'1_Původní'!K87","v":0},{"$f":"'2_Upravený'!L87-'1_Původní'!L87","v":0},{"$f":"'2_Upravený'!M87-'1_Původní'!M87","v":0},{"$f":"'2_Upravený'!N87-'1_Původní'!N87","v":0},{"$f":"'2_Upravený'!O87-'1_Původní'!O87","v":0},300000]
[null,{"$f":"IF('2_Upravený'!B88=\"\",\"\",'2_Upravený'!B88)","v":"8516"},{"$f":"IF('2_Upravený'!C88=\"\",\"\",'2_Upravený'!C88)","v":"Grant: Prof. RNDr. Tomáš Adam, PhD. - OKB"},{"$f":"'2_Upravený'!D88-'1_Původní'!D88","v":0},{"$f":"'2_Upravený'!E88-'1_Původní'!E88","v":0},{"$f":"'2_Upravený'!F88-'1_Původní'!F88","v":0},{"$f":"'2_Upravený'!G88-'1_Původní'!G88","v":0},{"$f":"'2_Upravený'!H88-'1_Původní'!H88","v":211000},{"$f":"'2_Upravený'!I88-'1_Původní'!I88","v":0},{"$f":"'2_Upravený'!J88-'1_Původní'!J88","v":0},{"$f":"'2_Upravený'!K88-'1_Původní'!K88","v":0},{"$f":"'2_Upravený'!L88-'1_Původní'!L88","v":0},{"$f":"'2_Upravený'!M88-'1_Původní'!M88","v":0},{"$f":"'2_Upravený'!N88-'1_Původní'!N88","v":0},{"$f":"'2_Upravený'!O88-'1_Původní'!O88","v":0},211000]
[null,{"$f":"IF('2_Upravený'!B89=\"\",\"\",'2_Upravený'!B89)","v":"8517"},{"$f":"IF('2_Upravený'!C89=\"\",\"\",'2_Upravený'!C89)","v":"Grant: Ing. David Kula, PhD., MBA - I.IK"},{"$f":"'2_Upravený'!D89-'1_Původní'!D89","v":0},{"$f":"'2_Upravený'!E89-'1_Původní'!E89","v":1071000},{"$f":"'2_Upravený'!F89-'1_Původní'!F89","v":0},{"$f":"'2_Upravený'!G89-'1_Původní'!G89","v":0},{"$f":"'2_Upravený'!H89-'1_Původní'!H89","v":0},{"$f":"'2_Upravený'!I89-'1_Původní'!I89","v":0},{"$f":"'2_Upravený'!J89-'1_Původní'!J89","v":0},{"$f":"'2_Upravený'!K89-'1_Původní'!K89","v":0},{"$f":"'2_Upravený'!L89-'1_Původní'!L89","v":0},{"$f":"'2_Upravený'!M89-'1_Původní'!M89","v":0},{"$f":"'2_Upravený'!N89-'1_Původní'!N89","v":0},{"$f":"'2_Upravený'!O89-'1_Původní'!O89","v":0},1071000]
[null,{"$f":"IF('2_Upravený'!B90=\"\",\"\",'2_Upravený'!B90)","v":""},{"$f":"IF('2_Upravený'!C90=\"\",\"\",'2_Upravený'!C90)","v":""},{"$f":"'2_Upravený'!D90-'1_Původní'!D90","v":0},{"$f":"'2_Upravený'!E90-'1_Původní'!E90","v":0},{"$f":"'2_Upravený'!F90-'1_Původní'!F90","v":0},{"$f":"'2_Upravený'!G90-'1_Původní'!G90","v":0},{"$f":"'2_Upravený'!H90-'1_Původní'!H90","v":0},{"$f":"'2_Upravený'!I90-'1_Původní'!I90","v":0},{"$f":"'2_Upravený'!J90-'1_Původní'!J90","v":0},{"$f":"'2_Upravený'!K90-'1_Původní'!K90","v":0},{"$f":"'2_Upravený'!L90-'1_Původní'!L90","v":0},{"$f":"'2_Upravený'!M90-'1_Původní'!M90","v":0},{"$f":"'2_Upravený'!N90-'1_Původní'!N90","v":0},{"$f":"'2_Upravený'!O90-'1_Původní'!O90","v":0},0]
[null,{"$f":"IF('2_Upravený'!B91=\"\",\"\",'2_Upravený'!B91)","v":""},{"$f":"IF('2_Upravený'!C91=\"\",\"\",'2_Upravený'!C91)","v":""},{"$f":"'2_Upravený'!D91-'1_Původní'!D91","v":0},{"$f":"'2_Upravený'!E91-'1_Původní'!E91","v":0},{"$f":"'2_Upravený'!F91-'1_Původní'!F91","v":0},{"$f":"'2_Upravený'!G91-'1_Původní'!G91","v":0},{"$f":"'2_Upravený'!H91-'1_Původní'!H91","v":0},{"$f":"'2_Upravený'!I91-'1_Původní'!I91","v":0},{"$f":"'2_Upravený'!J91-'1_Původní'!J91","v":0},{"$f":"'2_Upravený'!K91-'1_Původní'!K91","v":0},{"$f":"'2_Upravený'!L91-'1_Původní'!L91","v":0},{"$f":"'2_Upravený'!M91-'1_Původní'!M91","v":0},{"$f":"'2_Upravený'!N91-'1_Původní'!N91","v":0},{"$f":"'2_Upravený'!O91-'1_Původní'!O91","v":0},0]
[]
[67101002,"Transfery MZ na VaV - mzdové náklady",null,{"$f":"SUM(D104:D104)","v":0},0,0,0,0,0,0,0,0,0,0,0,0]
[null,{"$f":"IF('2_Upravený'!B94=\"\",\"\",'2_Upravený'!B94)","v":"8508"},{"$f":"IF('2_Upravený'!C94=\"\",\"\",'2_Upravený'!C94)","v":"Prof. MUDr. Miloš Táborský, CSc., FESC, MBA - I.IK"},{"$f":"'2_Upravený'!D94-'1_Původní'!D94","v":0},{"$f":"'2_Upravený'!E94-'1_Původní'!E94","v":0},{"$f":"'2_Upravený'!F94-'1_Původní'!F94","v":0},{"$f":"'2_Upravený'!G94-'1_Původní'!G94","v":0},{"$f":"'2_Upravený'!H94-'1_Původní'!H94","v":0},{"$f":"'2_Upravený'!I94-'1_Původní'!I94","v":0},{"$f":"'2_Upravený'!J94-'1_Původní'!J94","v":-349760.72889999999},{"$f":"'2_Upravený'!K94-'1_Původní'!K94","v":0},{"$f":"'2_Upravený'!L94-'1_Původní'!L94","v":0},{"$f":"'2_Upravený'!M94-'1_Původní'!M94","v":0},{"$f":"'2_Upravený'!N94-'1_Původní'!N94","v":0},{"$f":"'2_Upravený'!O94-'1_Původní'!O94","v":1215.8032000000001},{"$f":"SUM(D94:O94)","v":-348544.92569999996}]
[null,{"$f":"IF('2_Upravený'!B95=\"\",\"\",'2_Upravený'!B95)","v":"8509"},{"$f":"IF('2_Upravený'!C95=\"\",\"\",'2_Upravený'!C95)","v":"Doc. MUDr. Daniel Šaňák, PhD. - NEUROL"},{"$f":"'2_Upravený'!D95-'1_Původní'!D95","v":0},{"$f":"'2_Upravený'!E95-'1_Původní'!E95","v":0},{"$f":"'2_Upravený'!F95-'1_Původní'!F95","v":0},{"$f":"'2_Upravený'!G95-'1_Původní'!G95","v":0},{"$f":"'2_Upravený'!H95-'1_Původní'!H95","v":0},{"$f":"'2_Upravený'!I95-'1_Původní'!I95","v":0},{"$f":"'2_Upravený'!J95-'1_Původní'!J95","v":-1276985.6525000001},{"$f":"'2_Upravený'!K95-'1_Původní'!K95","v":0},{"$f":"'2_Upravený'!L95-'1_Původní'!L95","v":0},{"$f":"'2_Upravený'!M95-'1_Původní'!M95","v":0},{"$f":"'2_Upravený'!N95-'1_Původní'!N95","v":0},{"$f":"'2_Upravený'!O95-'1_Původní'!O95","v":84258.928899999999},{"$f":"SUM(D95:O95)","v":-1192726.7236000001}]
[null,{"$f":"IF('2_Upravený'!B96=\"\",\"\",'2_Upravený'!B96)","v":"8510"},{"$f":"IF('2_Upravený'!C96=\"\",\"\",'2_Upravený'!C96)","v":"Doc. MUDr. Petr Hamal, PhD. - MIKRO"},{"$f":"'2_Upravený'!D96-'1_Původní'!D96","v":0},{"$f":"'2_Upravený'!E96-'1_Původní'!E96","v":0},{"$f":"'2_Upravený'!F96-'1_Původní'!F96","v":0},{"$f":"'2_Upravený'!G96-'1_Původní'!G96","v":0},{"$f":"'2_Upravený'!H96-'1_Původní'!H96","v":0},{"$f":"'2_Upravený'!I96-'1_Původní'!I96","v":0},{"$f":"'2_Upravený'!J96-'1_Původní'!J96","v":-606183.55070000002},{"$f":"'2_Upravený'!K96-'1_Původní'!K96","v":0},{"$f":"'2_Upravený'!L96-'1_Původní'!L96","v":0},{"$f":"'2_Upravený'!M96-'1_Původní'!M96","v":0},{"$f":"'2_Upravený'!N96-'1_Původní'!N96","v":0},{"$f":"'2_Upravený'!O96-'1_Původní'!O96","v":675.32539999999995},-605508.22530000005]
[null,{"$f":"IF('2_Upravený'!B97=\"\",\"\",'2_Upravený'!B97)","v":"8511"},{"$f":"IF('2_Upravený'!C97=\"\",\"\",'2_Upravený'!C97)","v":"Prof. MUDr. Radovan Pilka, PhD. - PORGYN"},{"$f":"'2_Upravený'!D97-'1_Původní'!D97","v":0},{"$f":"'2_Upravený'!E97-'1_Původní'!E97","v":0},{"$f":"'2_Upravený'!F97-'1_Původní'!F97","v":0},{"$f":"'2_Upravený'!G97-'1_Původní'!G97","v":-829784.2513},{"$f":"'2_Upravený'!H97-'1_Původní'!H97","v":0},{"$f":"'2_Upravený'!I97-'1_Původní'!I97","v":809000},{"$f":"'2_Upravený'!J97-'1_Původní'!J97","v":0},{"$f":"'2_Upravený'!K97-'1_Původní'!K97","v":0},{"$f":"'2_Upravený'!L97-'1_Původní'!L97","v":0},{"$f":"'2_Upravený'!M97-'1_Původní'!M97","v":0},{"$f":"'2_Upravený'!N97-'1_Původní'!N97","v":0},{"$f":"'2_Upravený'!O97-'1_Původní'!O97","v":48543.148000000001},27758.896699999998]
[null,{"$f":"IF('2_Upravený'!B98=\"\",\"\",'2_Upravený'!B98)","v":"8512"},{"$f":"IF('2_Upravený'!C98=\"\",\"\",'2_Upravený'!C98)","v":"Grant: MUDr. Martin Loveček, PhD. - I. CHIR"},{"$f":"'2_Upravený'!D98-'1_Původní'!D98","v":0},{"$f":"'2_Upravený'!E98-'1_Původní'!E98","v":0},{"$f":"'2_Upravený'!F98-'1_Původní'!F98","v":0},{"$f":"'2_Upravený'!G98-'1_Původní'!G98","v":0},{"$f":"'2_Upravený'!H98-'1_Původní'!H98","v":502000},{"$f":"'2_Upravený'!I98-'1_Původní'!I98","v":-342580.88990000001},{"$f":"'2_Upravený'!J98-'1_Původní'!J98","v":0},{"$f":"'2_Upravený'!K98-'1_Původní'!K98","v":0},{"$f":"'2_Upravený'!L98-'1_Původní'!L98","v":0},{"$f":"'2_Upravený'!M98-'1_Původní'!M98","v":0},{"$f":"'2_Upravený'!N98-'1_Původní'!N98","v":0},{"$f":"'2_Upravený'!O98-'1_Původní'!O98","v":2160.3519999999999},161579.4621]
[null,{"$f":"IF('2_Upravený'!B99=\"\",\"\",'2_Upravený'!B99)","v":"8513"},{"$f":"IF('2_Upravený'!C99=\"\",\"\",'2_Upravený'!C99)","v":"Grant: MUDr. Martin Šín, PhD., FEBO - OČNÍ"},{"$f":"'2_Upravený'!D99-'1_Původní'!D99","v":0},{"$f":"'2_Upravený'!E99-'1_Původní'!E99","v":0},{"$f":"'2_Upravený'!F99-'1_Původní'!F99","v":0},{"$f":"'2_Upravený'!G99-'1_Původní'!G99","v":0},{"$f":"'2_Upravený'!H99-'1_Původní'!H99","v":616000},{"$f":"'2_Upravený'!I99-'1_Původní'!I99","v":-419507.73639999999},{"$f":"'2_Upravený'!J99-'1_Původní'!J99","v":0},{"$f":"'2_Upravený'!K99-'1_Původní'!K99","v":0},{"$f":"'2_Upravený'!L99-'1_Původní'!L99","v":0},{"$f":"'2_Upravený'!M99-'1_Původní'!M99","v":0},{"$f":"'2_Upravený'!N99-'1_Původní'!N99","v":0},{"$f":"'2_Upravený'!O99-'1_Původní'!O99","v":0},196492.26360000001]
[null,{"$f":"IF('2_Upravený'!B100=\"\",\"\",'2_Upravený'!B100)","v":"8514"},{"$f":"IF('2_Upravený'!C100=\"\",\"\",'2_Upravený'!C100)","v":"Grant: Doc. MUDr. Miroslav Vaverka, CSc. - NEUROCH"},{"$f":"'2_Upravený'!D100-'1_Původní'!D100","v":0},{"$f":"'2_Upravený'!E100-'1_Původní'!E100","v":0},{"$f":"'2_Upravený'!F100-'1_Původní'!F100","v":0},{"$f":"'2_Upravený'!G100-'1_Původní'!G100","v":0},{"$f":"'2_Upravený'!H100-'1_Původní'!H100","v":0},{"$f":"'2_Upravený'!I100-'1_Původní'!I100","v":91118.655399999989},{"$f":"'2_Upravený'!J100-'1_Původní'!J100","v":0},{"$f":"'2_Upravený'!K100-'1_Původní'!K100","v":0},{"$f":"'2_Upravený'!L100-'1_Původní'!L100","v":0},{"$f":"'2_Upravený'!M100-'1_Původní'!M100","v":0},{"$f":"'2_Upravený'!N100-'1_Původní'!N100","v":0},{"$f":"'2_Upravený'!O100-'1_Původní'!O100","v":8830.5967999999993},99949.252199999988]
[null,{"$f":"IF('2_Upravený'!B101=\"\",\"\",'2_Upravený'!B101)","v":"8515"},{"$f":"IF('2_Upravený'!C101=\"\",\"\",'2_Upravený'!C101)","v":"Grant: Doc. Dr. Ing. Eva Kriegová - IMUNO"},{"$f":"'2_Upravený'!D101-'1_Původní'!D101","v":0},{"$f":"'2_Upravený'!E101-'1_Původní'!E101","v":0},{"$f":"'2_Upravený'!F101-'1_Původní'!F101","v":0},{"$f":"'2_Upravený'!G101-'1_Původní'!G101","v":0},{"$f":"'2_Upravený'!H101-'1_Původní'!H101","v":620000},{"$f":"'2_Upravený'!I101-'1_Původní'!I101","v":0},{"$f":"'2_Upravený'!J101-'1_Původní'!J101","v":0},{"$f":"'2_Upravený'!K101-'1_Původní'!K101","v":0},{"$f":"'2_Upravený'!L101-'1_Původní'!L101","v":0},{"$f":"'2_Upravený'!M101-'1_Původní'!M101","v":0},{"$f":"'2_Upravený'!N101-'1_Původní'!N101","v":0},{"$f":"'2_Upravený'!O101-'1_Původní'!O101","v":0},620000]
[null,{"$f":"IF('2_Upravený'!B102=\"\",\"\",'2_Upravený'!B102)","v":"8516"},{"$f":"IF('2_Upravený'!C102=\"\",\"\",'2_Upravený'!C102)","v":"Grant: Prof. RNDr. Tomáš Adam, PhD. - OKB"},{"$f":"'2_Upravený'!D102-'1_Původní'!D102","v":0},{"$f":"'2_Upravený'!E102-'1_Původní'!E102","v":0},{"$f":"'2_Upravený'!F102-'1_Původní'!F102","v":0},{"$f":"'2_Upravený'!G102-'1_Původní'!G102","v":0},{"$f":"'2_Upravený'!H102-'1_Původní'!H102","v":483000},{"$f":"'2_Upravený'!I102-'1_Původní'!I102","v":0},{"$f":"'2_Upravený'!J102-'1_Původní'!J102","v":0},{"$f":"'2_Upravený'!K102-'1_Původní'!K102","v":0},{"$f":"'2_Upravený'!L102-'1_Původní'!L102","v":0},{"$f":"'2_Upravený'!M102-'1_Původní'!M102","v":0},{"$f":"'2_Upravený'!N102-'1_Původní'!N102","v":0},{"$f":"'2_Upravený'!O102-'1_Původní'!O102","v":0},483000]
[null,{"$f":"IF('2_Upravený'!B103=\"\",\"\",'2_Upravený'!B103)","v":"8517"},{"$f":"IF('2_Upravený'!C103=\"\",\"\",'2_Upravený'!C103)","v":"Grant: Ing. David Kula, PhD., MBA - I.IK"},{"$f":"'2_Upravený'!D103-'1_Původní'!D103","v":0},{"$f":"'2_Upravený'!E103-'1_Původní'!E103","v":0},{"$f":"'2_Upravený'!F103-'1_Původní'!F103","v":558000},{"$f":"'2_Upravený'!G103-'1_Původní'!G103","v":0},{"$f":"'2_Upravený'!H103-'1_Původní'!H103","v":0},{"$f":"'2_Upravený'!I103-'1_Původní'!I103","v":0},{"$f":"'2_Upravený'!J103-'1_Původní'!J103","v":0},{"$f":"'2_Upravený'!K103-'1_Původní'!K103","v":0},{"$f":"'2_Upravený'!L103-'1_Původní'!L103","v":0},{"$f":"'2_Upravený'!M103-'1_Původní'!M103","v":0},{"$f":"'2_Upravený'!N103-'1_Původní'!N103","v":0},{"$f":"'2_Upravený'!O103-'1_Původní'!O103","v":0},558000]
[null,{"$f":"IF('2_Upravený'!B104=\"\",\"\",'2_Upravený'!B104)","v":""},{"$f":"IF('2_Upravený'!C104=\"\",\"\",'2_Upravený'!C104)","v":""},{"$f":"'2_Upravený'!D104-'1_Původní'!D104","v":0},{"$f":"'2_Upravený'!E104-'1_Původní'!E104","v":0},{"$f":"'2_Upravený'!F104-'1_Původní'!F104","v":0},{"$f":"'2_Upravený'!G104-'1_Původní'!G104","v":0},{"$f":"'2_Upravený'!H104-'1_Původní'!H104","v":0},{"$f":"'2_Upravený'!I104-'1_Původní'!I104","v":0},{"$f":"'2_Upravený'!J104-'1_Původní'!J104","v":0},{"$f":"'2_Upravený'!K104-'1_Původní'!K104","v":0},{"$f":"'2_Upravený'!L104-'1_Původní'!L104","v":0},{"$f":"'2_Upravený'!M104-'1_Původní'!M104","v":0},{"$f":"'2_Upravený'!N104-'1_Původní'!N104","v":0},{"$f":"'2_Upravený'!O104-'1_Původní'!O104","v":0},0]
[]
[67101006,"Transfery MZ na rezidenční místa",null,{"$f":"SUM(D132:D132)","v":0},0,0,0,0,0,0,0,0,0,0,0,0]
[null,{"$f":"IF('2_Upravený'!B107=\"\",\"\",'2_Upravený'!B107)","v":"0184"},{"$f":"IF('2_Upravený'!C107=\"\",\"\",'2_Upravený'!C107)","v":"1IK: rezidenti 2019 - nelékařské obory"},{"$f":"'2_Upravený'!D107-'1_Původní'!D107","v":0},{"$f":"'2_Upravený'!E107-'1_Původní'!E107","v":0},{"$f":"'2_Upravený'!F107-'1_Původní'!F107","v":0},{"$f":"'2_Upravený'!G107-'1_Původní'!G107","v":0},{"$f":"'2_Upravený'!H107-'1_Původní'!H107","v":0},{"$f":"'2_Upravený'!I107-'1_Původní'!I107","v":0},{"$f":"'2_Upravený'!J107-'1_Původní'!J107","v":0},{"$f":"'2_Upravený'!K107-'1_Původní'!K107","v":0},{"$f":"'2_Upravený'!L107-'1_Původní'!L107","v":0},{"$f":"'2_Upravený'!M107-'1_Původní'!M107","v":0},{"$f":"'2_Upravený'!N107-'1_Původní'!N107","v":0},{"$f":"'2_Upravený'!O107-'1_Původní'!O107","v":0},{"$f":"SUM(D107:O107)","v":0}]
[null,{"$f":"IF('2_Upravený'!B108=\"\",\"\",'2_Upravený'!B108)","v":"0185"},{"$f":"IF('2_Upravený'!C108=\"\",\"\",'2_Upravený'!C108)","v":"Rezidenti 2018 - nelékařské obory"},{"$f":"'2_Upravený'!D108-'1_Původní'!D108","v":0},{"$f":"'2_Upravený'!E108-'1_Původní'!E108","v":0},{"$f":"'2_Upravený'!F108-'1_Původní'!F108","v":0},{"$f":"'2_Upravený'!G108-'1_Původní'!G108","v":0},{"$f":"'2_Upravený'!H108-'1_Původní'!H108","v":0},{"$f":"'2_Upravený'!I108-'1_Původní'!I108","v":0},{"$f":"'2_Upravený'!J108-'1_Původní'!J108","v":0},{"$f":"'2_Upravený'!K108-'1_Původní'!K108","v":0},{"$f":"'2_Upravený'!L108-'1_Původní'!L108","v":0},{"$f":"'2_Upravený'!M108-'1_Původní'!M108","v":0},{"$f":"'2_Upravený'!N108-'1_Původní'!N108","v":0},{"$f":"'2_Upravený'!O108-'1_Původní'!O108","v":0},{"$f":"SUM(D108:O108)","v":0}]
[null,{"$f":"IF('2_Upravený'!B109=\"\",\"\",'2_Upravený'!B109)","v":"0188"},{"$f":"IF('2_Upravený'!C109=\"\",\"\",'2_Upravený'!C109)","v":"Rezidenti 2017 - nelékařské obory"},{"$f":"'2_Upravený'!D109-'1_Původní'!D109","v":0},{"$f":"'2_Upravený'!E109-'1_Původní'!E109","v":0},{"$f":"'2_Upravený'!F109-'1_Původní'!F109","v":0},{"$f":"'2_Upravený'!G109-'1_Původní'!G109","v":0},{"$f":"'2_Upravený'!H109-'1_Původní'!H109","v":0},{"$f":"'2_Upravený'!I109-'1_Původní'!I109","v":0},{"$f":"'2_Upravený'!J109-'1_Původní'!J109","v":0},{"$f":"'2_Upravený'!K109-'1_Původní'!K109","v":0},{"$f":"'2_Upravený'!L109-'1_Původní'!L109","v":0},{"$f":"'2_Upravený'!M109-'1_Původní'!M109","v":0},{"$f":"'2_Upravený'!N109-'1_Původní'!N109","v":0},{"$f":"'2_Upravený'!O109-'1_Původní'!O109","v":0},0]
[null,{"$f":"IF('2_Upravený'!B110=\"\",\"\",'2_Upravený'!B110)","v":"0286"},{"$f":"IF('2_Upravený'!C110=\"\",\"\",'2_Upravený'!C110)","v":"Rezidenti 2018 - lékaři"},{"$f":"'2_Upravený'!D110-'1_Původní'!D110","v":0},{"$f":"'2_Upravený'!E110-'1_Původní'!E110","v":0},{"$f":"'2_Upravený'!F110-'1_Původní'!F110","v":0},{"$f":"'2_Upravený'!G110-'1_Původní'!G110","v":0},{"$f":"'2_Upravený'!H110-'1_Původní'!H110","v":0},{"$f":"'2_Upravený'!I110-'1_Původní'!I110","v":0},{"$f":"'2_Upravený'!J110-'1_Původní'!J110","v":0},{"$f":"'2_Upravený'!K110-'1_Původní'!K110","v":0},{"$f":"'2_Upravený'!L110-'1_Původní'!L110","v":0},{"$f":"'2_Upravený'!M110-'1_Původní'!M110","v":0},{"$f":"'2_Upravený'!N110-'1_Původní'!N110","v":0},{"$f":"'2_Upravený'!O110-'1_Původní'!O110","v":0},0]
[null,{"$f":"IF('2_Upravený'!B111=\"\",\"\",'2_Upravený'!B111)","v":"0386"},{"$f":"IF('2_Upravený'!C111=\"\",\"\",'2_Upravený'!C111)","v":"3IK: Rezidenti 2019 - lékaři"},{"$f":"'2_Upravený'!D111-'1_Původní'!D111","v":0},{"$f":"'2_Upravený'!E111-'1_Původní'!E111","v":0},{"$f":"'2_Upravený'!F111-'1_Původní'!F111","v":0},{"$f":"'2_Upravený'!G111-'1_Původní'!G111","v":0},{"$f":"'2_Upravený'!H111-'1_Původní'!H111","v":0},{"$f":"'2_Upravený'!I111-'1_Původní'!I111","v":0},{"$f":"'2_Upravený'!J111-'1_Původní'!J111","v":0},{"$f":"'2_Upravený'!K111-'1_Původní'!K111","v":0},{"$f":"'2_Upravený'!L111-'1_Původní'!L111","v":0},{"$f":"'2_Upravený'!M111-'1_Původní'!M111","v":0},{"$f":"'2_Upravený'!N111-'1_Původní'!N111","v":0},{"$f":"'2_Upravený'!O111-'1_Původní'!O111","v":0},0]
[null,{"$f":"IF('2_Upravený'!B112=\"\",\"\",'2_Upravený'!B112)","v":"0685"},{"$f":"IF('2_Upravený'!C112=\"\",\"\",'2_Upravený'!C112)","v":"Rezidenti 2018"},{"$f":"'2_Upravený'!D112-'1_Původní'!D112","v":0},{"$f":"'2_Upravený'!E112-'1_Původní'!E112","v":0},{"$f":"'2_Upravený'!F112-'1_Původní'!F112","v":0},{"$f":"'2_Upravený'!G112-'1_Původní'!G112","v":0},{"$f":"'2_Upravený'!H112-'1_Původní'!H112","v":0},{"$f":"'2_Upravený'!I112-'1_Původní'!I112","v":0},{"$f":"'2_Upravený'!J112-'1_Původní'!J112","v":0},{"$f":"'2_Upravený'!K112-'1_Původní'!K112","v":0},{"$f":"'2_Upravený'!L112-'1_Původní'!L112","v":0},{"$f":"'2_Upravený'!M112-'1_Původní'!M112","v":0},{"$f":"'2_Upravený'!N112-'1_Původní'!N112","v":0},{"$f":"'2_Upravený'!O112-'1_Původní'!O112","v":0},0]
[null,{"$f":"IF('2_Upravený'!B113=\"\",\"\",'2_Upravený'!B113)","v":"0688"},{"$f":"IF('2_Upravený'!C113=\"\",\"\",'2_Upravený'!C113)","v":"Rezidenti 2017 - nelékařské obory"},{"$f":"'2_Upravený'!D113-'1_Původní'!D113","v":0},{"$f":"'2_Upravený'!E113-'1_Původní'!E113","v":0},{"$f":"'2_Upravený'!F113-'1_Původní'!F113","v":0},{"$f":"'2_Upravený'!G113-'1_Původní'!G113","v":0},{"$f":"'2_Upravený'!H113-'1_Původní'!H113","v":0},{"$f":"'2_Upravený'!I113-'1_Původní'!I113","v":0},{"$f":"'2_Upravený'!J113-'1_Původní'!J113","v":0},{"$f":"'2_Upravený'!K113-'1_Původní'!K113","v":0},{"$f":"'2_Upravený'!L113-'1_Původní'!L113","v":0},{"$f":"'2_Upravený'!M113-'1_Původní'!M113","v":0},{"$f":"'2_Upravený'!N113-'1_Původní'!N113","v":0},{"$f":"'2_Upravený'!O113-'1_Původní'!O113","v":0},0]
[null,{"$f":"IF('2_Upravený'!B114=\"\",\"\",'2_Upravený'!B114)","v":"0785"},{"$f":"IF('2_Upravený'!C114=\"\",\"\",'2_Upravený'!C114)","v":"Rezidenti 2018"},{"$f":"'2_Upravený'!D114-'1_Původní'!D114","v":0},{"$f":"'2_Upravený'!E114-'1_Původní'!E114","v":0},{"$f":"'2_Upravený'!F114-'1_Původní'!F114","v":0},{"$f":"'2_Upravený'!G114-'1_Původní'!G114","v":0},{"$f":"'2_Upravený'!H114-'1_Původní'!H114","v":0},{"$f":"'2_Upravený'!I114-'1_Původní'!I114","v":0},{"$f":"'2_Upravený'!J114-'1_Původní'!J114","v":0},{"$f":"'2_Upravený'!K114-'1_Původní'!K114","v":0},{"$f":"'2_Upravený'!L114-'1_Původní'!L114","v":0},{"$f":"'2_Upravený'!M114-'1_Původní'!M114","v":0},{"$f":"'2_Upravený'!N114-'1_Původní'!N114","v":0},{"$f":"'2_Upravený'!O114-'1_Původní'!O114","v":0},0]
[null,{"$f":"IF('2_Upravený'!B115=\"\",\"\",'2_Upravený'!B115)","v":"0788"},{"$f":"IF('2_Upravený'!C115=\"\",\"\",'2_Upravený'!C115)","v":"Rezidenti 2017 - nelékařské obory"},{"$f":"'2_Upravený'!D115-'1_Původní'!D115","v":0},{"$f":"'2_Upravený'!E115-'1_Původní'!E115","v":0},{"$f":"'2_Upravený'!F115-'1_Původní'!F115","v":0},{"$f":"'2_Upravený'!G115-'1_Původní'!G115","v":0},{"$f":"'2_Upravený'!H115-'1_Původní'!H115","v":0},{"$f":"'2_Upravený'!I115-'1_Původní'!I115","v":0},{"$f":"'2_Upravený'!J115-'1_Původní'!J115","v":0},{"$f":"'2_Upravený'!K115-'1_Původní'!K115","v":0},{"$f":"'2_Upravený'!L115-'1_Původní'!L115","v":0},{"$f":"'2_Upravený'!M115-'1_Původní'!M115","v":0},{"$f":"'2_Upravený'!N115-'1_Původní'!N115","v":0},{"$f":"'2_Upravený'!O115-'1_Původní'!O115","v":0},0]
[null,{"$f":"IF('2_Upravený'!B116=\"\",\"\",'2_Upravený'!B116)","v":"0885"},{"$f":"IF('2_Upravený'!C116=\"\",\"\",'2_Upravený'!C116)","v":"Rezidenti 2018"},{"$f":"'2_Upravený'!D116-'1_Původní'!D116","v":0},{"$f":"'2_Upravený'!E116-'1_Původní'!E116","v":0},{"$f":"'2_Upravený'!F116-'1_Původní'!F116","v":0},{"$f":"'2_Upravený'!G116-'1_Původní'!G116","v":0},{"$f":"'2_Upravený'!H116-'1_Původní'!H116","v":0},{"$f":"'2_Upravený'!I116-'1_Původní'!I116","v":0},{"$f":"'2_Upravený'!J116-'1_Původní'!J116","v":0},{"$f":"'2_Upravený'!K116-'1_Původní'!K116","v":0},{"$f":"'2_Upravený'!L116-'1_Původní'!L116","v":0},{"$f":"'2_Upravený'!M116-'1_Původní'!M116","v":0},{"$f":"'2_Upravený'!N116-'1_Původní'!N116","v":0},{"$f":"'2_Upravený'!O116-'1_Původní'!O116","v":0},0]
[null,{"$f":"IF('2_Upravený'!B117=\"\",\"\",'2_Upravený'!B117)","v":"0886"},{"$f":"IF('2_Upravený'!C117=\"\",\"\",'2_Upravený'!C117)","v":"Rezidenti 2018"},{"$f":"'2_Upravený'!D117-'1_Původní'!D117","v":0},{"$f":"'2_Upravený'!E117-'1_Původní'!E117","v":0},{"$f":"'2_Upravený'!F117-'1_Původní'!F117","v":0},{"$f":"'2_Upravený'!G117-'1_Původní'!G117","v":0},{"$f":"'2_Upravený'!H117-'1_Původní'!H117","v":0},{"$f":"'2_Upravený'!I117-'1_Původní'!I117","v":0},{"$f":"'2_Upravený'!J117-'1_Původní'!J117","v":0},{"$f":"'2_Upravený'!K117-'1_Původní'!K117","v":0},{"$f":"'2_Upravený'!L117-'1_Původní'!L117","v":0},{"$f":"'2_Upravený'!M117-'1_Původní'!M117","v":0},{"$f":"'2_Upravený'!N117-'1_Původní'!N117","v":0},{"$f":"'2_Upravený'!O117-'1_Původní'!O117","v":0},0]
[null,{"$f":"IF('2_Upravený'!B118=\"\",\"\",'2_Upravený'!B118)","v":"0988"},{"$f":"IF('2_Upravený'!C118=\"\",\"\",'2_Upravený'!C118)","v":"Rezidenti 2017 - nelékařské obory"},{"$f":"'2_Upravený'!D118-'1_Původní'!D118","v":0},{"$f":"'2_Upravený'!E118-'1_Původní'!E118","v":0},{"$f":"'2_Upravený'!F118-'1_Původní'!F118","v":0},{"$f":"'2_Upravený'!G118-'1_Původní'!G118","v":0},{"$f":"'2_Upravený'!H118-'1_Původní'!H118","v":0},{"$f":"'2_Upravený'!I118-'1_Původní'!I118","v":0},{"$f":"'2_Upravený'!J118-'1_Původní'!J118","v":0},{"$f":"'2_Upravený'!K118-'1_Původní'!K118","v":0},{"$f":"'2_Upravený'!L118-'1_Původní'!L118","v":0},{"$f":"'2_Upravený'!M118-'1_Původní'!M118","v":0},{"$f":"'2_Upravený'!N118-'1_Původní'!N118","v":0},{"$f":"'2_Upravený'!O118-'1_Původní'!O118","v":0},0]
[null,{"$f":"IF('2_Upravený'!B119=\"\",\"\",'2_Upravený'!B119)","v":"1083"},{"$f":"IF('2_Upravený'!C119=\"\",\"\",'2_Upravený'!C119)","v":"Rezidenti 2016 - ošetřovatelská a intenzivní péče"},{"$f":"'2_Upravený'!D119-'1_Původní'!D119","v":0},{"$f":"'2_Upravený'!E119-'1_Původní'!E119","v":0},{"$f":"'2_Upravený'!F119-'1_Původní'!F119","v":0},{"$f":"'2_Upravený'!G119-'1_Původní'!G119","v":0},{"$f":"'2_Upravený'!H119-'1_Původní'!H119","v":0},{"$f":"'2_Upravený'!I119-'1_Původní'!I119","v":0},{"$f":"'2_Upravený'!J119-'1_Původní'!J119","v":0},{"$f":"'2_Upravený'!K119-'1_Původní'!K119","v":0},{"$f":"'2_Upravený'!L119-'1_Původní'!L119","v":0},{"$f":"'2_Upravený'!M119-'1_Původní'!M119","v":0},{"$f":"'2_Upravený'!N119-'1_Původní'!N119","v":0},{"$f":"'2_Upravený'!O119-'1_Původní'!O119","v":0},0]
[null,{"$f":"IF('2_Upravený'!B120=\"\",\"\",'2_Upravený'!B120)","v":"1086"},{"$f":"IF('2_Upravený'!C120=\"\",\"\",'2_Upravený'!C120)","v":"DK: Rezidenti 2019 - lékaři"},{"$f":"'2_Upravený'!D120-'1_Původní'!D120","v":0},{"$f":"'2_Upravený'!E120-'1_Původní'!E120","v":0},{"$f":"'2_Upravený'!F120-'1_Původní'!F120","v":0},{"$f":"'2_Upravený'!G120-'1_Původní'!G120","v":0},{"$f":"'2_Upravený'!H120-'1_Původní'!H120","v":0},{"$f":"'2_Upravený'!I120-'1_Původní'!I120","v":0},{"$f":"'2_Upravený'!J120-'1_Původní'!J120","v":0},{"$f":"'2_Upravený'!K120-'1_Původní'!K120","v":0},{"$f":"'2_Upravený'!L120-'1_Původní'!L120","v":0},{"$f":"'2_Upravený'!M120-'1_Původní'!M120","v":0},{"$f":"'2_Upravený'!N120-'1_Původní'!N120","v":0},{"$f":"'2_Upravený'!O120-'1_Původní'!O120","v":0},0]
[null,{"$f":"IF('2_Upravený'!B121=\"\",\"\",'2_Upravený'!B121)","v":"1185"},{"$f":"IF('2_Upravený'!C121=\"\",\"\",'2_Upravený'!C121)","v":"Rezidenti 2018"},{"$f":"'2_Upravený'!D121-'1_Původní'!D121","v":0},{"$f":"'2_Upravený'!E121-'1_Původní'!E121","v":0},{"$f":"'2_Upravený'!F121-'1_Původní'!F121","v":0},{"$f":"'2_Upravený'!G121-'1_Původní'!G121","v":0},{"$f":"'2_Upravený'!H121-'1_Původní'!H121","v":0},{"$f":"'2_Upravený'!I121-'1_Původní'!I121","v":0},{"$f":"'2_Upravený'!J121-'1_Původní'!J121","v":0},{"$f":"'2_Upravený'!K121-'1_Původní'!K121","v":0},{"$f":"'2_Upravený'!L121-'1_Původní'!L121","v":0},{"$f":"'2_Upravený'!M121-'1_Původní'!M121","v":0},{"$f":"'2_Upravený'!N121-'1_Původní'!N121","v":0},{"$f":"'2_Upravený'!O121-'1_Původní'!O121","v":0},0]
[null,{"$f":"IF('2_Upravený'!B122=\"\",\"\",'2_Upravený'!B122)","v":"1188"},{"$f":"IF('2_Upravený'!C122=\"\",\"\",'2_Upravený'!C122)","v":"Rezidenti 2017 - nelékařské obory"},{"$f":"'2_Upravený'!D122-'1_Původní'!D122","v":0},{"$f":"'2_Upravený'!E122-'1_Původní'!E122","v":0},{"$f":"'2_Upravený'!F122-'1_Původní'!F122","v":0},{"$f":"'2_Upravený'!G122-'1_Původní'!G122","v":0},{"$f":"'2_Upravený'!H122-'1_Původní'!H122","v":0},{"$f":"'2_Upravený'!I122-'1_Původní'!I122","v":0},{"$f":"'2_Upravený'!J122-'1_Původní'!J122","v":0},{"$f":"'2_Upravený'!K122-'1_Původní'!K122","v":0},{"$f":"'2_Upravený'!L122-'1_Původní'!L122","v":0},{"$f":"'2_Upravený'!M122-'1_Původní'!M122","v":0},{"$f":"'2_Upravený'!N122-'1_Původní'!N122","v":0},{"$f":"'2_Upravený'!O122-'1_Původní'!O122","v":0},0]
[null,{"$f":"IF('2_Upravený'!B123=\"\",\"\",'2_Upravený'!B123)","v":"1388"},{"$f":"IF('2_Upravený'!C123=\"\",\"\",'2_Upravený'!C123)","v":"Rezidenti 2017 - nelékařské obory"},{"$f":"'2_Upravený'!D123-'1_Původní'!D123","v":0},{"$f":"'2_Upravený'!E123-'1_Původní'!E123","v":0},{"$f":"'2_Upravený'!F123-'1_Původní'!F123","v":0},{"$f":"'2_Upravený'!G123-'1_Původní'!G123","v":0},{"$f":"'2_Upravený'!H123-'1_Původní'!H123","v":0},{"$f":"'2_Upravený'!I123-'1_Původní'!I123","v":0},{"$f":"'2_Upravený'!J123-'1_Původní'!J123","v":0},{"$f":"'2_Upravený'!K123-'1_Původní'!K123","v":0},{"$f":"'2_Upravený'!L123-'1_Původní'!L123","v":0},{"$f":"'2_Upravený'!M123-'1_Původní'!M123","v":0},{"$f":"'2_Upravený'!N123-'1_Původní'!N123","v":0},{"$f":"'2_Upravený'!O123-'1_Původní'!O123","v":0},0]
[null,{"$f":"IF('2_Upravený'!B124=\"\",\"\",'2_Upravený'!B124)","v":"1685"},{"$f":"IF('2_Upravený'!C124=\"\",\"\",'2_Upravený'!C124)","v":"Rezidenti 2018"},{"$f":"'2_Upravený'!D124-'1_Původní'!D124","v":0},{"$f":"'2_Upravený'!E124-'1_Původní'!E124","v":0},{"$f":"'2_Upravený'!F124-'1_Původní'!F124","v":0},{"$f":"'2_Upravený'!G124-'1_Původní'!G124","v":0},{"$f":"'2_Upravený'!H124-'1_Původní'!H124","v":0},{"$f":"'2_Upravený'!I124-'1_Původní'!I124","v":0},{"$f":"'2_Upravený'!J124-'1_Původní'!J124","v":0},{"$f":"'2_Upravený'!K124-'1_Původní'!K124","v":0},{"$f":"'2_Upravený'!L124-'1_Původní'!L124","v":0},{"$f":"'2_Upravený'!M124-'1_Původní'!M124","v":0},{"$f":"'2_Upravený'!N124-'1_Původní'!N124","v":0},{"$f":"'2_Upravený'!O124-'1_Původní'!O124","v":0},0]
[null,{"$f":"IF('2_Upravený'!B125=\"\",\"\",'2_Upravený'!B125)","v":"1686"},{"$f":"IF('2_Upravený'!C125=\"\",\"\",'2_Upravený'!C125)","v":"PLIC: rezidenti 2019 - lékaři"},{"$f":"'2_Upravený'!D125-'1_Původní'!D125","v":0},{"$f":"'2_Upravený'!E125-'1_Původní'!E125","v":0},{"$f":"'2_Upravený'!F125-'1_Původní'!F125","v":0},{"$f":"'2_Upravený'!G125-'1_Původní'!G125","v":0},{"$f":"'2_Upravený'!H125-'1_Původní'!H125","v":0},{"$f":"'2_Upravený'!I125-'1_Původní'!I125","v":0},{"$f":"'2_Upravený'!J125-'1_Původní'!J125","v":0},{"$f":"'2_Upravený'!K125-'1_Původní'!K125","v":0},{"$f":"'2_Upravený'!L125-'1_Původní'!L125","v":0},{"$f":"'2_Upravený'!M125-'1_Původní'!M125","v":0},{"$f":"'2_Upravený'!N125-'1_Původní'!N125","v":0},{"$f":"'2_Upravený'!O125-'1_Původní'!O125","v":0},0]
[null,{"$f":"IF('2_Upravený'!B126=\"\",\"\",'2_Upravený'!B126)","v":"1886"},{"$f":"IF('2_Upravený'!C126=\"\",\"\",'2_Upravený'!C126)","v":"Rezidenti 2018"},{"$f":"'2_Upravený'!D126-'1_Původní'!D126","v":0},{"$f":"'2_Upravený'!E126-'1_Původní'!E126","v":0},{"$f":"'2_Upravený'!F126-'1_Původní'!F126","v":0},{"$f":"'2_Upravený'!G126-'1_Původní'!G126","v":0},{"$f":"'2_Upravený'!H126-'1_Původní'!H126","v":0},{"$f":"'2_Upravený'!I126-'1_Původní'!I126","v":0},{"$f":"'2_Upravený'!J126-'1_Původní'!J126","v":0},{"$f":"'2_Upravený'!K126-'1_Původní'!K126","v":0},{"$f":"'2_Upravený'!L126-'1_Původní'!L126","v":0},{"$f":"'2_Upravený'!M126-'1_Původní'!M126","v":0},{"$f":"'2_Upravený'!N126-'1_Původní'!N126","v":0},{"$f":"'2_Upravený'!O126-'1_Původní'!O126","v":0},0]
[null,{"$f":"IF('2_Upravený'!B127=\"\",\"\",'2_Upravený'!B127)","v":"3285"},{"$f":"IF('2_Upravený'!C127=\"\",\"\",'2_Upravený'!C127)","v":"Rezidenti 2018"},{"$f":"'2_Upravený'!D127-'1_Původní'!D127","v":0},{"$f":"'2_Upravený'!E127-'1_Původní'!E127","v":0},{"$f":"'2_Upravený'!F127-'1_Původní'!F127","v":0},{"$f":"'2_Upravený'!G127-'1_Původní'!G127","v":0},{"$f":"'2_Upravený'!H127-'1_Původní'!H127","v":0},{"$f":"'2_Upravený'!I127-'1_Původní'!I127","v":0},{"$f":"'2_Upravený'!J127-'1_Původní'!J127","v":0},{"$f":"'2_Upravený'!K127-'1_Původní'!K127","v":0},{"$f":"'2_Upravený'!L127-'1_Původní'!L127","v":0},{"$f":"'2_Upravený'!M127-'1_Původní'!M127","v":0},{"$f":"'2_Upravený'!N127-'1_Původní'!N127","v":0},{"$f":"'2_Upravený'!O127-'1_Původní'!O127","v":0},0]
[null,{"$f":"IF('2_Upravený'!B128=\"\",\"\",'2_Upravený'!B128)","v":"3485"},{"$f":"IF('2_Upravený'!C128=\"\",\"\",'2_Upravený'!C128)","v":"Rezidenti 2018"},{"$f":"'2_Upravený'!D128-'1_Původní'!D128","v":0},{"$f":"'2_Upravený'!E128-'1_Původní'!E128","v":0},{"$f":"'2_Upravený'!F128-'1_Původní'!F128","v":0},{"$f":"'2_Upravený'!G128-'1_Původní'!G128","v":0},{"$f":"'2_Upravený'!H128-'1_Původní'!H128","v":0},{"$f":"'2_Upravený'!I128-'1_Původní'!I128","v":0},{"$f":"'2_Upravený'!J128-'1_Původní'!J128","v":0},{"$f":"'2_Upravený'!K128-'1_Původní'!K128","v":0},{"$f":"'2_Upravený'!L128-'1_Původní'!L128","v":0},{"$f":"'2_Upravený'!M128-'1_Původní'!M128","v":0},{"$f":"'2_Upravený'!N128-'1_Původní'!N128","v":0},{"$f":"'2_Upravený'!O128-'1_Původní'!O128","v":0},0]
[null,{"$f":"IF('2_Upravený'!B129=\"\",\"\",'2_Upravený'!B129)","v":"5085"},{"$f":"IF('2_Upravený'!C129=\"\",\"\",'2_Upravený'!C129)","v":"Rezidenti 2018"},{"$f":"'2_Upravený'!D129-'1_Původní'!D129","v":0},{"$f":"'2_Upravený'!E129-'1_Původní'!E129","v":0},{"$f":"'2_Upravený'!F129-'1_Původní'!F129","v":0},{"$f":"'2_Upravený'!G129-'1_Původní'!G129","v":0},{"$f":"'2_Upravený'!H129-'1_Původní'!H129","v":0},{"$f":"'2_Upravený'!I129-'1_Původní'!I129","v":0},{"$f":"'2_Upravený'!J129-'1_Původní'!J129","v":0},{"$f":"'2_Upravený'!K129-'1_Původní'!K129","v":0},{"$f":"'2_Upravený'!L129-'1_Původní'!L129","v":0},{"$f":"'2_Upravený'!M129-'1_Původní'!M129","v":0},{"$f":"'2_Upravený'!N129-'1_Původní'!N129","v":0},{"$f":"'2_Upravený'!O129-'1_Původní'!O129","v":0},0]
[null,{"$f":"IF('2_Upravený'!B130=\"\",\"\",'2_Upravený'!B130)","v":"5684"},{"$f":"IF('2_Upravený'!C130=\"\",\"\",'2_Upravený'!C130)","v":""},{"$f":"'2_Upravený'!D130-'1_Původní'!D130","v":0},{"$f":"'2_Upravený'!E130-'1_Původní'!E130","v":0},{"$f":"'2_Upravený'!F130-'1_Původní'!F130","v":0},{"$f":"'2_Upravený'!G130-'1_Původní'!G130","v":0},{"$f":"'2_Upravený'!H130-'1_Původní'!H130","v":0},{"$f":"'2_Upravený'!I130-'1_Původní'!I130","v":0},{"$f":"'2_Upravený'!J130-'1_Původní'!J130","v":0},{"$f":"'2_Upravený'!K130-'1_Původní'!K130","v":0},{"$f":"'2_Upravený'!L130-'1_Původní'!L130","v":0},{"$f":"'2_Upravený'!M130-'1_Původní'!M130","v":0},{"$f":"'2_Upravený'!N130-'1_Původní'!N130","v":0},{"$f":"'2_Upravený'!O130-'1_Původní'!O130","v":0},0]
[null,{"$f":"IF('2_Upravený'!B131=\"\",\"\",'2_Upravený'!B131)","v":"6088"},{"$f":"IF('2_Upravený'!C131=\"\",\"\",'2_Upravený'!C131)","v":"Rezidenti 2017 - nelékařské obory"},{"$f":"'2_Upravený'!D131-'1_Původní'!D131","v":0},{"$f":"'2_Upravený'!E131-'1_Původní'!E131","v":0},{"$f":"'2_Upravený'!F131-'1_Původní'!F131","v":0},{"$f":"'2_Upravený'!G131-'1_Původní'!G131","v":0},{"$f":"'2_Upravený'!H131-'1_Původní'!H131","v":0},{"$f":"'2_Upravený'!I131-'1_Původní'!I131","v":0},{"$f":"'2_Upravený'!J131-'1_Původní'!J131","v":0},{"$f":"'2_Upravený'!K131-'1_Původní'!K131","v":0},{"$f":"'2_Upravený'!L131-'1_Původní'!L131","v":0},{"$f":"'2_Upravený'!M131-'1_Původní'!M131","v":0},{"$f":"'2_Upravený'!N131-'1_Původní'!N131","v":0},{"$f":"'2_Upravený'!O131-'1_Původní'!O131","v":0},0]
[null,{"$f":"IF('2_Upravený'!B132=\"\",\"\",'2_Upravený'!B132)","v":""},{"$f":"IF('2_Upravený'!C132=\"\",\"\",'2_Upravený'!C132)","v":""},{"$f":"'2_Upravený'!D132-'1_Původní'!D132","v":0},{"$f":"'2_Upravený'!E132-'1_Původní'!E132","v":0},{"$f":"'2_Upravený'!F132-'1_Původní'!F132","v":0},{"$f":"'2_Upravený'!G132-'1_Původní'!G132","v":0},{"$f":"'2_Upravený'!H132-'1_Původní'!H132","v":0},{"$f":"'2_Upravený'!I132-'1_Původní'!I132","v":0},{"$f":"'2_Upravený'!J132-'1_Původní'!J132","v":0},{"$f":"'2_Upravený'!K132-'1_Původní'!K132","v":0},{"$f":"'2_Upravený'!L132-'1_Původní'!L132","v":0},{"$f":"'2_Upravený'!M132-'1_Původní'!M132","v":0},{"$f":"'2_Upravený'!N132-'1_Původní'!N132","v":0},{"$f":"'2_Upravený'!O132-'1_Původní'!O132","v":0},0]
[]
[67101010,"Transfery MZ - RIV (institucionální podpora)",null,{"$f":"SUM(D163:D163)","v":0},0,0,0,0,0,0,0,0,0,0,0,0]
[null,{"$f":"IF('2_Upravený'!B135=\"\",\"\",'2_Upravený'!B135)","v":"8711"},{"$f":"IF('2_Upravený'!C135=\"\",\"\",'2_Upravený'!C135)","v":"RIV: doc. Mgr. Jan Bouchal, PhD."},{"$f":"'2_Upravený'!D135-'1_Původní'!D135","v":0},{"$f":"'2_Upravený'!E135-'1_Původní'!E135","v":0},{"$f":"'2_Upravený'!F135-'1_Původní'!F135","v":0},{"$f":"'2_Upravený'!G135-'1_Původní'!G135","v":-289763.69819999998},{"$f":"'2_Upravený'!H135-'1_Původní'!H135","v":0},{"$f":"'2_Upravený'!I135-'1_Původní'!I135","v":0},{"$f":"'2_Upravený'!J135-'1_Původní'!J135","v":0},{"$f":"'2_Upravený'!K135-'1_Původní'!K135","v":0},{"$f":"'2_Upravený'!L135-'1_Původní'!L135","v":0},{"$f":"'2_Upravený'!M135-'1_Původní'!M135","v":0},{"$f":"'2_Upravený'!N135-'1_Původní'!N135","v":0},{"$f":"'2_Upravený'!O135-'1_Původní'!O135","v":0},{"$f":"SUM(D135:O135)","v":-289763.69819999998}]
[null,{"$f":"IF('2_Upravený'!B136=\"\",\"\",'2_Upravený'!B136)","v":"8712"},{"$f":"IF('2_Upravený'!C136=\"\",\"\",'2_Upravený'!C136)","v":"RIV: prof. MUDr. Jiří Gallo, PhD."},{"$f":"'2_Upravený'!D136-'1_Původní'!D136","v":0},{"$f":"'2_Upravený'!E136-'1_Původní'!E136","v":0},{"$f":"'2_Upravený'!F136-'1_Původní'!F136","v":0},{"$f":"'2_Upravený'!G136-'1_Původní'!G136","v":-289763.69819999998},{"$f":"'2_Upravený'!H136-'1_Původní'!H136","v":0},{"$f":"'2_Upravený'!I136-'1_Původní'!I136","v":0},{"$f":"'2_Upravený'!J136-'1_Původní'!J136","v":0},{"$f":"'2_Upravený'!K136-'1_Původní'!K136","v":0},{"$f":"'2_Upravený'!L136-'1_Původní'!L136","v":0},{"$f":"'2_Upravený'!M136-'1_Původní'!M136","v":0},{"$f":"'2_Upravený'!N136-'1_Původní'!N136","v":0},{"$f":"'2_Upravený'!O136-'1_Původní'!O136","v":35634.316700000003},{"$f":"SUM(D136:O136)","v":-254129.38149999999}]
[null,{"$f":"IF('2_Upravený'!B137=\"\",\"\",'2_Upravený'!B137)","v":"8713"},{"$f":"IF('2_Upravený'!C137=\"\",\"\",'2_Upravený'!C137)","v":"RIV: MUDr. Matěj Halaj"},{"$f":"'2_Upravený'!D137-'1_Původní'!D137","v":0},{"$f":"'2_Upravený'!E137-'1_Původní'!E137","v":0},{"$f":"'2_Upravený'!F137-'1_Původní'!F137","v":0},{"$f":"'2_Upravený'!G137-'1_Původní'!G137","v":-289763.69819999998},{"$f":"'2_Upravený'!H137-'1_Původní'!H137","v":0},{"$f":"'2_Upravený'!I137-'1_Původní'!I137","v":0},{"$f":"'2_Upravený'!J137-'1_Původní'!J137","v":0},{"$f":"'2_Upravený'!K137-'1_Původní'!K137","v":0},{"$f":"'2_Upravený'!L137-'1_Původní'!L137","v":0},{"$f":"'2_Upravený'!M137-'1_Původní'!M137","v":0},{"$f":"'2_Upravený'!N137-'1_Původní'!N137","v":0},{"$f":"'2_Upravený'!O137-'1_Původní'!O137","v":6261.5153},-283502.18289999996]
[null,{"$f":"IF('2_Upravený'!B138=\"\",\"\",'2_Upravený'!B138)","v":"8715"},{"$f":"IF('2_Upravený'!C138=\"\",\"\",'2_Upravený'!C138)","v":"RIV: MUDr. Karel Huml"},{"$f":"'2_Upravený'!D138-'1_Původní'!D138","v":0},{"$f":"'2_Upravený'!E138-'1_Původní'!E138","v":0},{"$f":"'2_Upravený'!F138-'1_Původní'!F138","v":0},{"$f":"'2_Upravený'!G138-'1_Původní'!G138","v":-234645.54729999998},{"$f":"'2_Upravený'!H138-'1_Původní'!H138","v":0},{"$f":"'2_Upravený'!I138-'1_Původní'!I138","v":0},{"$f":"'2_Upravený'!J138-'1_Původní'!J138","v":0},{"$f":"'2_Upravený'!K138-'1_Původní'!K138","v":0},{"$f":"'2_Upravený'!L138-'1_Původní'!L138","v":0},{"$f":"'2_Upravený'!M138-'1_Původní'!M138","v":0},{"$f":"'2_Upravený'!N138-'1_Původní'!N138","v":0},{"$f":"'2_Upravený'!O138-'1_Původní'!O138","v":29128.9594},-205516.58789999998]
[null,{"$f":"IF('2_Upravený'!B139=\"\",\"\",'2_Upravený'!B139)","v":"8716"},{"$f":"IF('2_Upravený'!C139=\"\",\"\",'2_Upravený'!C139)","v":"RIV: MUDr. Beáta Hutyrová, PhD."},{"$f":"'2_Upravený'!D139-'1_Původní'!D139","v":0},{"$f":"'2_Upravený'!E139-'1_Původní'!E139","v":0},{"$f":"'2_Upravený'!F139-'1_Původní'!F139","v":0},{"$f":"'2_Upravený'!G139-'1_Původní'!G139","v":10236.301800000016},{"$f":"'2_Upravený'!H139-'1_Původní'!H139","v":0},{"$f":"'2_Upravený'!I139-'1_Původní'!I139","v":0},{"$f":"'2_Upravený'!J139-'1_Původní'!J139","v":0},{"$f":"'2_Upravený'!K139-'1_Původní'!K139","v":0},{"$f":"'2_Upravený'!L139-'1_Původní'!L139","v":0},{"$f":"'2_Upravený'!M139-'1_Původní'!M139","v":-34771.643799999998},{"$f":"'2_Upravený'!N139-'1_Původní'!N139","v":0},{"$f":"'2_Upravený'!O139-'1_Původní'!O139","v":62045.362099999998},37510.020100000016]
[null,{"$f":"IF('2_Upravený'!B140=\"\",\"\",'2_Upravený'!B140)","v":"8719"},{"$f":"IF('2_Upravený'!C140=\"\",\"\",'2_Upravený'!C140)","v":"RIV: MUDr. Hana Klosová, PhD."},{"$f":"'2_Upravený'!D140-'1_Původní'!D140","v":0},{"$f":"'2_Upravený'!E140-'1_Původní'!E140","v":0},{"$f":"'2_Upravený'!F140-'1_Původní'!F140","v":0},{"$f":"'2_Upravený'!G140-'1_Původní'!G140","v":102960.68520000001},{"$f":"'2_Upravený'!H140-'1_Původní'!H140","v":0},{"$f":"'2_Upravený'!I140-'1_Původní'!I140","v":0},{"$f":"'2_Upravený'!J140-'1_Původní'!J140","v":0},{"$f":"'2_Upravený'!K140-'1_Původní'!K140","v":0},{"$f":"'2_Upravený'!L140-'1_Původní'!L140","v":0},{"$f":"'2_Upravený'!M140-'1_Původní'!M140","v":0},{"$f":"'2_Upravený'!N140-'1_Původní'!N140","v":0},{"$f":"'2_Upravený'!O140-'1_Původní'!O140","v":30571.2988},133531.984]
[null,{"$f":"IF('2_Upravený'!B141=\"\",\"\",'2_Upravený'!B141)","v":"8720"},{"$f":"IF('2_Upravený'!C141=\"\",\"\",'2_Upravený'!C141)","v":"RIV: MUDr. Petr Kolář, PhD."},{"$f":"'2_Upravený'!D141-'1_Původní'!D141","v":0},{"$f":"'2_Upravený'!E141-'1_Původní'!E141","v":0},{"$f":"'2_Upravený'!F141-'1_Původní'!F141","v":0},{"$f":"'2_Upravený'!G141-'1_Původní'!G141","v":10236.301800000016},{"$f":"'2_Upravený'!H141-'1_Původní'!H141","v":0},{"$f":"'2_Upravený'!I141-'1_Původní'!I141","v":0},{"$f":"'2_Upravený'!J141-'1_Původní'!J141","v":0},{"$f":"'2_Upravený'!K141-'1_Původní'!K141","v":0},{"$f":"'2_Upravený'!L141-'1_Původní'!L141","v":0},{"$f":"'2_Upravený'!M141-'1_Původní'!M141","v":0},{"$f":"'2_Upravený'!N141-'1_Původní'!N141","v":0},{"$f":"'2_Upravený'!O141-'1_Původní'!O141","v":9231.3150999999998},19467.616900000015]
[null,{"$f":"IF('2_Upravený'!B142=\"\",\"\",'2_Upravený'!B142)","v":"8721"},{"$f":"IF('2_Upravený'!C142=\"\",\"\",'2_Upravený'!C142)","v":"RIV: MUDr. Andrea Smržová"},{"$f":"'2_Upravený'!D142-'1_Původní'!D142","v":0},{"$f":"'2_Upravený'!E142-'1_Původní'!E142","v":0},{"$f":"'2_Upravený'!F142-'1_Původní'!F142","v":0},{"$f":"'2_Upravený'!G142-'1_Původní'!G142","v":10236.301800000016},{"$f":"'2_Upravený'!H142-'1_Původní'!H142","v":0},{"$f":"'2_Upravený'!I142-'1_Původní'!I142","v":0},{"$f":"'2_Upravený'!J142-'1_Původní'!J142","v":0},{"$f":"'2_Upravený'!K142-'1_Původní'!K142","v":0},{"$f":"'2_Upravený'!L142-'1_Původní'!L142","v":0},{"$f":"'2_Upravený'!M142-'1_Původní'!M142","v":0},{"$f":"'2_Upravený'!N142-'1_Původní'!N142","v":0},{"$f":"'2_Upravený'!O142-'1_Původní'!O142","v":4007.2581},14243.559900000015]
[null,{"$f":"IF('2_Upravený'!B143=\"\",\"\",'2_Upravený'!B143)","v":"8724"},{"$f":"IF('2_Upravený'!C143=\"\",\"\",'2_Upravený'!C143)","v":"RIV: MUDr. Vladimír Študent, PhD."},{"$f":"'2_Upravený'!D143-'1_Původní'!D143","v":0},{"$f":"'2_Upravený'!E143-'1_Původní'!E143","v":0},{"$f":"'2_Upravený'!F143-'1_Původní'!F143","v":0},{"$f":"'2_Upravený'!G143-'1_Původní'!G143","v":76302.424999999988},{"$f":"'2_Upravený'!H143-'1_Původní'!H143","v":0},{"$f":"'2_Upravený'!I143-'1_Původní'!I143","v":0},{"$f":"'2_Upravený'!J143-'1_Původní'!J143","v":0},{"$f":"'2_Upravený'!K143-'1_Původní'!K143","v":0},{"$f":"'2_Upravený'!L143-'1_Původní'!L143","v":0},{"$f":"'2_Upravený'!M143-'1_Původní'!M143","v":0},{"$f":"'2_Upravený'!N143-'1_Původní'!N143","v":0},{"$f":"'2_Upravený'!O143-'1_Původní'!O143","v":32572.569100000001},108874.99409999998]
[null,{"$f":"IF('2_Upravený'!B144=\"\",\"\",'2_Upravený'!B144)","v":"8725"},{"$f":"IF('2_Upravený'!C144=\"\",\"\",'2_Upravený'!C144)","v":"RIV: MUDr. Helena Urbánková"},{"$f":"'2_Upravený'!D144-'1_Původní'!D144","v":0},{"$f":"'2_Upravený'!E144-'1_Původní'!E144","v":0},{"$f":"'2_Upravený'!F144-'1_Původní'!F144","v":0},{"$f":"'2_Upravený'!G144-'1_Původní'!G144","v":10236.301800000016},{"$f":"'2_Upravený'!H144-'1_Původní'!H144","v":0},{"$f":"'2_Upravený'!I144-'1_Původní'!I144","v":0},{"$f":"'2_Upravený'!J144-'1_Původní'!J144","v":0},{"$f":"'2_Upravený'!K144-'1_Původní'!K144","v":0},{"$f":"'2_Upravený'!L144-'1_Původní'!L144","v":0},{"$f":"'2_Upravený'!M144-'1_Původní'!M144","v":0},{"$f":"'2_Upravený'!N144-'1_Původní'!N144","v":0},{"$f":"'2_Upravený'!O144-'1_Původní'!O144","v":40605.607000000004},50841.908800000019]
[null,{"$f":"IF('2_Upravený'!B145=\"\",\"\",'2_Upravený'!B145)","v":"8726"},{"$f":"IF('2_Upravený'!C145=\"\",\"\",'2_Upravený'!C145)","v":"RIV: Mgr. Petr Vrtěl"},{"$f":"'2_Upravený'!D145-'1_Původní'!D145","v":0},{"$f":"'2_Upravený'!E145-'1_Původní'!E145","v":0},{"$f":"'2_Upravený'!F145-'1_Původní'!F145","v":0},{"$f":"'2_Upravený'!G145-'1_Původní'!G145","v":68189.041399999987},{"$f":"'2_Upravený'!H145-'1_Původní'!H145","v":0},{"$f":"'2_Upravený'!I145-'1_Původní'!I145","v":0},{"$f":"'2_Upravený'!J145-'1_Původní'!J145","v":0},{"$f":"'2_Upravený'!K145-'1_Původní'!K145","v":0},{"$f":"'2_Upravený'!L145-'1_Původní'!L145","v":0},{"$f":"'2_Upravený'!M145-'1_Původní'!M145","v":0},{"$f":"'2_Upravený'!N145-'1_Původní'!N145","v":0},{"$f":"'2_Upravený'!O145-'1_Původní'!O145","v":0},68189.041399999987]
[null,{"$f":"IF('2_Upravený'!B146=\"\",\"\",'2_Upravený'!B146)","v":"8753"},{"$f":"IF('2_Upravený'!C146=\"\",\"\",'2_Upravený'!C146)","v":"RIV: MUDr. Richard Salzmann, Ph.D."},{"$f":"'2_Upravený'!D146-'1_Původní'!D146","v":0},{"$f":"'2_Upravený'!E146-'1_Původní'!E146","v":0},{"$f":"'2_Upravený'!F146-'1_Původní'!F146","v":0},{"$f":"'2_Upravený'!G146-'1_Původní'!G146","v":-47716.437900000019},{"$f":"'2_Upravený'!H146-'1_Původní'!H146","v":0},{"$f":"'2_Upravený'!I146-'1_Původní'!I146","v":0},{"$f":"'2_Upravený'!J146-'1_Původní'!J146","v":0},{"$f":"'2_Upravený'!K146-'1_Původní'!K146","v":0},{"$f":"'2_Upravený'!L146-'1_Původní'!L146","v":0},{"$f":"'2_Upravený'!M146-'1_Původní'!M146","v":0},{"$f":"'2_Upravený'!N146-'1_Původní'!N146","v":0},{"$f":"'2_Upravený'!O146-'1_Původní'!O146","v":1594.8594000000001},-46121.578500000018]
[null,{"$f":"IF('2_Upravený'!B147=\"\",\"\",'2_Upravený'!B147)","v":"8760"},{"$f":"IF('2_Upravený'!C147=\"\",\"\",'2_Upravený'!C147)","v":"RIV: RNDr. Martin Novák, Ph.D."},{"$f":"'2_Upravený'!D147-'1_Původní'!D147","v":0},{"$f":"'2_Upravený'!E147-'1_Původní'!E147","v":0},{"$f":"'2_Upravený'!F147-'1_Původní'!F147","v":0},{"$f":"'2_Upravený'!G147-'1_Původní'!G147","v":56598.493500000011},{"$f":"'2_Upravený'!H147-'1_Původní'!H147","v":0},{"$f":"'2_Upravený'!I147-'1_Původní'!I147","v":0},{"$f":"'2_Upravený'!J147-'1_Původní'!J147","v":0},{"$f":"'2_Upravený'!K147-'1_Původní'!K147","v":0},{"$f":"'2_Upravený'!L147-'1_Původní'!L147","v":0},{"$f":"'2_Upravený'!M147-'1_Původní'!M147","v":0},{"$f":"'2_Upravený'!N147-'1_Původní'!N147","v":0},{"$f":"'2_Upravený'!O147-'1_Původní'!O147","v":36412.343800000002},93010.837300000014]
[null,{"$f":"IF('2_Upravený'!B148=\"\",\"\",'2_Upravený'!B148)","v":"8762"},{"$f":"IF('2_Upravený'!C148=\"\",\"\",'2_Upravený'!C148)","v":"RIV - Doc. MUDr. David Karásek, Ph. D."},{"$f":"'2_Upravený'!D148-'1_Původní'!D148","v":0},{"$f":"'2_Upravený'!E148-'1_Původní'!E148","v":0},{"$f":"'2_Upravený'!F148-'1_Původní'!F148","v":0},{"$f":"'2_Upravený'!G148-'1_Původní'!G148","v":-47716.437900000019},{"$f":"'2_Upravený'!H148-'1_Původní'!H148","v":0},{"$f":"'2_Upravený'!I148-'1_Původní'!I148","v":0},{"$f":"'2_Upravený'!J148-'1_Původní'!J148","v":0},{"$f":"'2_Upravený'!K148-'1_Původní'!K148","v":0},{"$f":"'2_Upravený'!L148-'1_Původní'!L148","v":0},{"$f":"'2_Upravený'!M148-'1_Původní'!M148","v":0},{"$f":"'2_Upravený'!N148-'1_Původní'!N148","v":0},{"$f":"'2_Upravený'!O148-'1_Původní'!O148","v":11885.353499999999},-35831.084400000022]
[null,{"$f":"IF('2_Upravený'!B149=\"\",\"\",'2_Upravený'!B149)","v":"8777"},{"$f":"IF('2_Upravený'!C149=\"\",\"\",'2_Upravený'!C149)","v":"RIV: Prof. MUDr. Radovan Pilka, Ph.D."},{"$f":"'2_Upravený'!D149-'1_Původní'!D149","v":0},{"$f":"'2_Upravený'!E149-'1_Původní'!E149","v":0},{"$f":"'2_Upravený'!F149-'1_Původní'!F149","v":0},{"$f":"'2_Upravený'!G149-'1_Původní'!G149","v":10236.301800000016},{"$f":"'2_Upravený'!H149-'1_Původní'!H149","v":0},{"$f":"'2_Upravený'!I149-'1_Původní'!I149","v":0},{"$f":"'2_Upravený'!J149-'1_Původní'!J149","v":0},{"$f":"'2_Upravený'!K149-'1_Původní'!K149","v":0},{"$f":"'2_Upravený'!L149-'1_Původní'!L149","v":0},{"$f":"'2_Upravený'!M149-'1_Původní'!M149","v":0},{"$f":"'2_Upravený'!N149-'1_Původní'!N149","v":0},{"$f":"'2_Upravený'!O149-'1_Původní'!O149","v":8056.5550999999996},18292.856900000013]
[null,{"$f":"IF('2_Upravený'!B150=\"\",\"\",'2_Upravený'!B150)","v":"8780"},{"$f":"IF('2_Upravený'!C150=\"\",\"\",'2_Upravený'!C150)","v":"RIV - MUDr. Eva Karásková"},{"$f":"'2_Upravený'!D150-'1_Původní'!D150","v":0},{"$f":"'2_Upravený'!E150-'1_Původní'!E150","v":0},{"$f":"'2_Upravený'!F150-'1_Původní'!F150","v":0},{"$f":"'2_Upravený'!G150-'1_Původní'!G150","v":-47716.437900000019},{"$f":"'2_Upravený'!H150-'1_Původní'!H150","v":0},{"$f":"'2_Upravený'!I150-'1_Původní'!I150","v":0},{"$f":"'2_Upravený'!J150-'1_Původní'!J150","v":0},{"$f":"'2_Upravený'!K150-'1_Původní'!K150","v":0},{"$f":"'2_Upravený'!L150-'1_Původní'!L150","v":0},{"$f":"'2_Upravený'!M150-'1_Původní'!M150","v":0},{"$f":"'2_Upravený'!N150-'1_Původní'!N150","v":0},{"$f":"'2_Upravený'!O150-'1_Původní'!O150","v":1685.4743000000001},-46030.963600000017]
[null,{"$f":"IF('2_Upravený'!B151=\"\",\"\",'2_Upravený'!B151)","v":"8782"},{"$f":"IF('2_Upravený'!C151=\"\",\"\",'2_Upravený'!C151)","v":"RIV - RNDr. Pavlína Čapková, Ph. D."},{"$f":"'2_Upravený'!D151-'1_Původní'!D151","v":0},{"$f":"'2_Upravený'!E151-'1_Původní'!E151","v":0},{"$f":"'2_Upravený'!F151-'1_Původní'!F151","v":0},{"$f":"'2_Upravený'!G151-'1_Původní'!G151","v":10236.301800000016},{"$f":"'2_Upravený'!H151-'1_Původní'!H151","v":0},{"$f":"'2_Upravený'!I151-'1_Původní'!I151","v":0},{"$f":"'2_Upravený'!J151-'1_Původní'!J151","v":0},{"$f":"'2_Upravený'!K151-'1_Původní'!K151","v":0},{"$f":"'2_Upravený'!L151-'1_Původní'!L151","v":0},{"$f":"'2_Upravený'!M151-'1_Původní'!M151","v":0},{"$f":"'2_Upravený'!N151-'1_Původní'!N151","v":0},{"$f":"'2_Upravený'!O151-'1_Původní'!O151","v":0},10236.301800000016]
[null,{"$f":"IF('2_Upravený'!B152=\"\",\"\",'2_Upravený'!B152)","v":"8785"},{"$f":"IF('2_Upravený'!C152=\"\",\"\",'2_Upravený'!C152)","v":"RIV - Doc. MUDr. Martin Hutyra, Ph. D."},{"$f":"'2_Upravený'!D152-'1_Původní'!D152","v":0},{"$f":"'2_Upravený'!E152-'1_Původní'!E152","v":0},{"$f":"'2_Upravený'!F152-'1_Původní'!F152","v":0},{"$f":"'2_Upravený'!G152-'1_Původní'!G152","v":-47716.437900000019},{"$f":"'2_Upravený'!H152-'1_Původní'!H152","v":0},{"$f":"'2_Upravený'!I152-'1_Původní'!I152","v":0},{"$f":"'2_Upravený'!J152-'1_Původní'!J152","v":0},{"$f":"'2_Upravený'!K152-'1_Původní'!K152","v":0},{"$f":"'2_Upravený'!L152-'1_Původní'!L152","v":0},{"$f":"'2_Upravený'!M152-'1_Původní'!M152","v":0},{"$f":"'2_Upravený'!N152-'1_Původní'!N152","v":0},{"$f":"'2_Upravený'!O152-'1_Původní'!O152","v":74911.855500000005},27195.417599999986]
[null,{"$f":"IF('2_Upravený'!B153=\"\",\"\",'2_Upravený'!B153)","v":"8789"},{"$f":"IF('2_Upravený'!C153=\"\",\"\",'2_Upravený'!C153)","v":"RIV - Doc. MUDr. Kateřina Menšíková, Ph. D. - MEX"},{"$f":"'2_Upravený'!D153-'1_Původní'!D153","v":0},{"$f":"'2_Upravený'!E153-'1_Původní'!E153","v":0},{"$f":"'2_Upravený'!F153-'1_Původní'!F153","v":0},{"$f":"'2_Upravený'!G153-'1_Původní'!G153","v":-695432.87569999998},{"$f":"'2_Upravený'!H153-'1_Původní'!H153","v":0},{"$f":"'2_Upravený'!I153-'1_Původní'!I153","v":0},{"$f":"'2_Upravený'!J153-'1_Původní'!J153","v":0},{"$f":"'2_Upravený'!K153-'1_Původní'!K153","v":0},{"$f":"'2_Upravený'!L153-'1_Původní'!L153","v":0},{"$f":"'2_Upravený'!M153-'1_Původní'!M153","v":0},{"$f":"'2_Upravený'!N153-'1_Původní'!N153","v":0},{"$f":"'2_Upravený'!O153-'1_Původní'!O153","v":7245.4254000000001},-688187.45030000003]
[null,{"$f":"IF('2_Upravený'!B154=\"\",\"\",'2_Upravený'!B154)","v":"8791"},{"$f":"IF('2_Upravený'!C154=\"\",\"\",'2_Upravený'!C154)","v":"RIV - Doc. Mgr. Luděk Slavík, Ph. D. - MEX"},{"$f":"'2_Upravený'!D154-'1_Původní'!D154","v":0},{"$f":"'2_Upravený'!E154-'1_Původní'!E154","v":0},{"$f":"'2_Upravený'!F154-'1_Původní'!F154","v":0},{"$f":"'2_Upravený'!G154-'1_Původní'!G154","v":-718613.97160000005},{"$f":"'2_Upravený'!H154-'1_Původní'!H154","v":0},{"$f":"'2_Upravený'!I154-'1_Původní'!I154","v":0},{"$f":"'2_Upravený'!J154-'1_Původní'!J154","v":0},{"$f":"'2_Upravený'!K154-'1_Původní'!K154","v":0},{"$f":"'2_Upravený'!L154-'1_Původní'!L154","v":0},{"$f":"'2_Upravený'!M154-'1_Původní'!M154","v":0},{"$f":"'2_Upravený'!N154-'1_Původní'!N154","v":0},{"$f":"'2_Upravený'!O154-'1_Původní'!O154","v":1572.1303},-717041.84130000009]
[null,{"$f":"IF('2_Upravený'!B155=\"\",\"\",'2_Upravený'!B155)","v":"8792"},{"$f":"IF('2_Upravený'!C155=\"\",\"\",'2_Upravený'!C155)","v":"RIV - Prof. MUDr. Jiří Gallo, Ph. D. - MEX"},{"$f":"'2_Upravený'!D155-'1_Původní'!D155","v":0},{"$f":"'2_Upravený'!E155-'1_Původní'!E155","v":0},{"$f":"'2_Upravený'!F155-'1_Původní'!F155","v":0},{"$f":"'2_Upravený'!G155-'1_Původní'!G155","v":-695432.87569999998},{"$f":"'2_Upravený'!H155-'1_Původní'!H155","v":0},{"$f":"'2_Upravený'!I155-'1_Původní'!I155","v":0},{"$f":"'2_Upravený'!J155-'1_Původní'!J155","v":0},{"$f":"'2_Upravený'!K155-'1_Původní'!K155","v":0},{"$f":"'2_Upravený'!L155-'1_Původní'!L155","v":0},{"$f":"'2_Upravený'!M155-'1_Původní'!M155","v":0},{"$f":"'2_Upravený'!N155-'1_Původní'!N155","v":0},{"$f":"'2_Upravený'!O155-'1_Původní'!O155","v":2299.5994999999998},-693133.27619999996]
[null,{"$f":"IF('2_Upravený'!B156=\"\",\"\",'2_Upravený'!B156)","v":"8793"},{"$f":"IF('2_Upravený'!C156=\"\",\"\",'2_Upravený'!C156)","v":"RIV: prof. MUDr. Milan Raška, PhD. - MEX"},{"$f":"'2_Upravený'!D156-'1_Původní'!D156","v":0},{"$f":"'2_Upravený'!E156-'1_Původní'!E156","v":0},{"$f":"'2_Upravený'!F156-'1_Původní'!F156","v":0},{"$f":"'2_Upravený'!G156-'1_Původní'!G156","v":-657184.0675},{"$f":"'2_Upravený'!H156-'1_Původní'!H156","v":0},{"$f":"'2_Upravený'!I156-'1_Původní'!I156","v":0},{"$f":"'2_Upravený'!J156-'1_Původní'!J156","v":0},{"$f":"'2_Upravený'!K156-'1_Původní'!K156","v":0},{"$f":"'2_Upravený'!L156-'1_Původní'!L156","v":0},{"$f":"'2_Upravený'!M156-'1_Původní'!M156","v":34771.643799999998},{"$f":"'2_Upravený'!N156-'1_Původní'!N156","v":0},{"$f":"'2_Upravený'!O156-'1_Původní'!O156","v":44.148400000000002},-622368.2753000001]
[null,{"$f":"IF('2_Upravený'!B157=\"\",\"\",'2_Upravený'!B157)","v":"8794"},{"$f":"IF('2_Upravený'!C157=\"\",\"\",'2_Upravený'!C157)","v":"RIV: MUDr. Martin Loveček, PhD. - MEX"},{"$f":"'2_Upravený'!D157-'1_Původní'!D157","v":0},{"$f":"'2_Upravený'!E157-'1_Původní'!E157","v":0},{"$f":"'2_Upravený'!F157-'1_Původní'!F157","v":0},{"$f":"'2_Upravený'!G157-'1_Původní'!G157","v":287055.2059},{"$f":"'2_Upravený'!H157-'1_Původní'!H157","v":0},{"$f":"'2_Upravený'!I157-'1_Původní'!I157","v":0},{"$f":"'2_Upravený'!J157-'1_Původní'!J157","v":0},{"$f":"'2_Upravený'!K157-'1_Původní'!K157","v":0},{"$f":"'2_Upravený'!L157-'1_Původní'!L157","v":0},{"$f":"'2_Upravený'!M157-'1_Původní'!M157","v":0},{"$f":"'2_Upravený'!N157-'1_Původní'!N157","v":0},{"$f":"'2_Upravený'!O157-'1_Původní'!O157","v":13176.5753},300231.78120000003]
[null,{"$f":"IF('2_Upravený'!B158=\"\",\"\",'2_Upravený'!B158)","v":"8795"},{"$f":"IF('2_Upravený'!C158=\"\",\"\",'2_Upravený'!C158)","v":"RIV: doc. MUDr. Martin Vrba , PhD. - MEX"},{"$f":"'2_Upravený'!D158-'1_Původní'!D158","v":0},{"$f":"'2_Upravený'!E158-'1_Původní'!E158","v":0},{"$f":"'2_Upravený'!F158-'1_Původní'!F158","v":0},{"$f":"'2_Upravený'!G158-'1_Původní'!G158","v":600000},{"$f":"'2_Upravený'!H158-'1_Původní'!H158","v":0},{"$f":"'2_Upravený'!I158-'1_Původní'!I158","v":0},{"$f":"'2_Upravený'!J158-'1_Původní'!J158","v":0},{"$f":"'2_Upravený'!K158-'1_Původní'!K158","v":0},{"$f":"'2_Upravený'!L158-'1_Původní'!L158","v":0},{"$f":"'2_Upravený'!M158-'1_Původní'!M158","v":0},{"$f":"'2_Upravený'!N158-'1_Původní'!N158","v":0},{"$f":"'2_Upravený'!O158-'1_Původní'!O158","v":0},600000]
[null,{"$f":"IF('2_Upravený'!B159=\"\",\"\",'2_Upravený'!B159)","v":"8796"},{"$f":"IF('2_Upravený'!C159=\"\",\"\",'2_Upravený'!C159)","v":"RIV: doc. MUDr. Přemysl Falt, PhD. - MEX"},{"$f":"'2_Upravený'!D159-'1_Původní'!D159","v":0},{"$f":"'2_Upravený'!E159-'1_Původní'!E159","v":0},{"$f":"'2_Upravený'!F159-'1_Původní'!F159","v":0},{"$f":"'2_Upravený'!G159-'1_Původní'!G159","v":600000},{"$f":"'2_Upravený'!H159-'1_Původní'!H159","v":0},{"$f":"'2_Upravený'!I159-'1_Původní'!I159","v":0},{"$f":"'2_Upravený'!J159-'1_Původní'!J159","v":0},{"$f":"'2_Upravený'!K159-'1_Původní'!K159","v":0},{"$f":"'2_Upravený'!L159-'1_Původní'!L159","v":0},{"$f":"'2_Upravený'!M159-'1_Původní'!M159","v":0},{"$f":"'2_Upravený'!N159-'1_Původní'!N159","v":0},{"$f":"'2_Upravený'!O159-'1_Původní'!O159","v":0},600000]
[null,{"$f":"IF('2_Upravený'!B160=\"\",\"\",'2_Upravený'!B160)","v":"8797"},{"$f":"IF('2_Upravený'!C160=\"\",\"\",'2_Upravený'!C160)","v":"RIV: prof. MUDr. Jiří Gallo, PhD. - MEX"},{"$f":"'2_Upravený'!D160-'1_Původní'!D160","v":0},{"$f":"'2_Upravený'!E160-'1_Původní'!E160","v":0},{"$f":"'2_Upravený'!F160-'1_Původní'!F160","v":0},{"$f":"'2_Upravený'!G160-'1_Původní'!G160","v":600000},{"$f":"'2_Upravený'!H160-'1_Původní'!H160","v":0},{"$f":"'2_Upravený'!I160-'1_Původní'!I160","v":0},{"$f":"'2_Upravený'!J160-'1_Původní'!J160","v":0},{"$f":"'2_Upravený'!K160-'1_Původní'!K160","v":0},{"$f":"'2_Upravený'!L160-'1_Původní'!L160","v":0},{"$f":"'2_Upravený'!M160-'1_Původní'!M160","v":0},{"$f":"'2_Upravený'!N160-'1_Původní'!N160","v":0},{"$f":"'2_Upravený'!O160-'1_Původní'!O160","v":0},600000]
[null,{"$f":"IF('2_Upravený'!B161=\"\",\"\",'2_Upravený'!B161)","v":"8798"},{"$f":"IF('2_Upravený'!C161=\"\",\"\",'2_Upravený'!C161)","v":"RIV: prof. MUDr. Miloš Táborský, PhD. - MEX"},{"$f":"'2_Upravený'!D161-'1_Původní'!D161","v":0},{"$f":"'2_Upravený'!E161-'1_Původní'!E161","v":0},{"$f":"'2_Upravený'!F161-'1_Původní'!F161","v":0},{"$f":"'2_Upravený'!G161-'1_Původní'!G161","v":600000},{"$f":"'2_Upravený'!H161-'1_Původní'!H161","v":0},{"$f":"'2_Upravený'!I161-'1_Původní'!I161","v":0},{"$f":"'2_Upravený'!J161-'1_Původní'!J161","v":0},{"$f":"'2_Upravený'!K161-'1_Původní'!K161","v":0},{"$f":"'2_Upravený'!L161-'1_Původní'!L161","v":0},{"$f":"'2_Upravený'!M161-'1_Původní'!M161","v":0},{"$f":"'2_Upravený'!N161-'1_Původní'!N161","v":0},{"$f":"'2_Upravený'!O161-'1_Původní'!O161","v":0},600000]
[null,{"$f":"IF('2_Upravený'!B162=\"\",\"\",'2_Upravený'!B162)","v":"8799"},{"$f":"IF('2_Upravený'!C162=\"\",\"\",'2_Upravený'!C162)","v":"RIV: doc. MUDr. Radek Vodička, PhD. - MEX"},{"$f":"'2_Upravený'!D162-'1_Původní'!D162","v":0},{"$f":"'2_Upravený'!E162-'1_Původní'!E162","v":0},{"$f":"'2_Upravený'!F162-'1_Původní'!F162","v":0},{"$f":"'2_Upravený'!G162-'1_Původní'!G162","v":600000},{"$f":"'2_Upravený'!H162-'1_Původní'!H162","v":0},{"$f":"'2_Upravený'!I162-'1_Původní'!I162","v":0},{"$f":"'2_Upravený'!J162-'1_Původní'!J162","v":0},{"$f":"'2_Upravený'!K162-'1_Původní'!K162","v":0},{"$f":"'2_Upravený'!L162-'1_Původní'!L162","v":0},{"$f":"'2_Upravený'!M162-'1_Původní'!M162","v":0},{"$f":"'2_Upravený'!N162-'1_Původní'!N162","v":0},{"$f":"'2_Upravený'!O162-'1_Původní'!O162","v":0},600000]
[null,{"$f":"IF('2_Upravený'!B163=\"\",\"\",'2_Upravený'!B163)","v":""},{"$f":"IF('2_Upravený'!C163=\"\",\"\",'2_Upravený'!C163)","v":""},{"$f":"'2_Upravený'!D163-'1_Původní'!D163","v":0},{"$f":"'2_Upravený'!E163-'1_Původní'!E163","v":0},{"$f":"'2_Upravený'!F163-'1_Původní'!F163","v":0},{"$f":"'2_Upravený'!G163-'1_Původní'!G163","v":0},{"$f":"'2_Upravený'!H163-'1_Původní'!H163","v":0},{"$f":"'2_Upravený'!I163-'1_Původní'!I163","v":0},{"$f":"'2_Upravený'!J163-'1_Původní'!J163","v":0},{"$f":"'2_Upravený'!K163-'1_Původní'!K163","v":0},{"$f":"'2_Upravený'!L163-'1_Původní'!L163","v":0},{"$f":"'2_Upravený'!M163-'1_Původní'!M163","v":0},{"$f":"'2_Upravený'!N163-'1_Původní'!N163","v":0},{"$f":"'2_Upravený'!O163-'1_Původní'!O163","v":0},0]
[]
[67101011,"Transfery MZ - MEDEVAC (humanitární program)",null,{"$f":"SUM(D168:D168)","v":0},0,0,0,0,0,0,0,0,0,0,0,0]
[null,{"$f":"IF('2_Upravený'!B166=\"\",\"\",'2_Upravený'!B166)","v":"9813"},{"$f":"IF('2_Upravený'!C166=\"\",\"\",'2_Upravený'!C166)","v":"MEDEVAC"},{"$f":"'2_Upravený'!D166-'1_Původní'!D166","v":0},{"$f":"'2_Upravený'!E166-'1_Původní'!E166","v":0},{"$f":"'2_Upravený'!F166-'1_Původní'!F166","v":0},{"$f":"'2_Upravený'!G166-'1_Původní'!G166","v":0},{"$f":"'2_Upravený'!H166-'1_Původní'!H166","v":0},{"$f":"'2_Upravený'!I166-'1_Původní'!I166","v":0},{"$f":"'2_Upravený'!J166-'1_Původní'!J166","v":0},{"$f":"'2_Upravený'!K166-'1_Původní'!K166","v":0},{"$f":"'2_Upravený'!L166-'1_Původní'!L166","v":0},{"$f":"'2_Upravený'!M166-'1_Původní'!M166","v":0},{"$f":"'2_Upravený'!N166-'1_Původní'!N166","v":-286063.72529999999},{"$f":"'2_Upravený'!O166-'1_Původní'!O166","v":-116936.27469999999},{"$f":"SUM(D166:O166)","v":-403000}]
[null,{"$f":"IF('2_Upravený'!B167=\"\",\"\",'2_Upravený'!B167)","v":"9810"},{"$f":"IF('2_Upravený'!C167=\"\",\"\",'2_Upravený'!C167)","v":"TranMZČR: Zabezpečení svoláv. a varovného sys.-MZ"},{"$f":"'2_Upravený'!D167-'1_Původní'!D167","v":0},{"$f":"'2_Upravený'!E167-'1_Původní'!E167","v":0},{"$f":"'2_Upravený'!F167-'1_Původní'!F167","v":0},{"$f":"'2_Upravený'!G167-'1_Původní'!G167","v":0},{"$f":"'2_Upravený'!H167-'1_Původní'!H167","v":0},{"$f":"'2_Upravený'!I167-'1_Původní'!I167","v":0},{"$f":"'2_Upravený'!J167-'1_Původní'!J167","v":0},{"$f":"'2_Upravený'!K167-'1_Původní'!K167","v":0},{"$f":"'2_Upravený'!L167-'1_Původní'!L167","v":0},{"$f":"'2_Upravený'!M167-'1_Původní'!M167","v":0},{"$f":"'2_Upravený'!N167-'1_Původní'!N167","v":403000},{"$f":"'2_Upravený'!O167-'1_Původní'!O167","v":0},{"$f":"SUM(D167:O167)","v":403000}]
[null,{"$f":"IF('2_Upravený'!B168=\"\",\"\",'2_Upravený'!B168)","v":""},{"$f":"IF('2_Upravený'!C168=\"\",\"\",'2_Upravený'!C168)","v":""},{"$f":"'2_Upravený'!D168-'1_Původní'!D168","v":0},{"$f":"'2_Upravený'!E168-'1_Původní'!E168","v":0},{"$f":"'2_Upravený'!F168-'1_Původní'!F168","v":0},{"$f":"'2_Upravený'!G168-'1_Původní'!G168","v":0},{"$f":"'2_Upravený'!H168-'1_Původní'!H168","v":0},{"$f":"'2_Upravený'!I168-'1_Původní'!I168","v":0},{"$f":"'2_Upravený'!J168-'1_Původní'!J168","v":0},{"$f":"'2_Upravený'!K168-'1_Původní'!K168","v":0},{"$f":"'2_Upravený'!L168-'1_Původní'!L168","v":0},{"$f":"'2_Upravený'!M168-'1_Původní'!M168","v":0},{"$f":"'2_Upravený'!N168-'1_Původní'!N168","v":0},{"$f":"'2_Upravený'!O168-'1_Původní'!O168","v":0},0]
[]
[67102001,"Transfery jiného poskytovatele - VaV věcné",null,{"$f":"SUM(D204:D204)","v":0},0,0,0,0,0,0,0,0,0,0,0,0]
[null,{"$f":"IF('2_Upravený'!B171=\"\",\"\",'2_Upravený'!B171)","v":"8542"},{"$f":"IF('2_Upravený'!C171=\"\",\"\",'2_Upravený'!C171)","v":"Prof. MUDr. Jiří Ehrmann, Ph.D. - PATOL"},{"$f":"'2_Upravený'!D171-'1_Původní'!D171","v":0},{"$f":"'2_Upravený'!E171-'1_Původní'!E171","v":0},{"$f":"'2_Upravený'!F171-'1_Původní'!F171","v":0},{"$f":"'2_Upravený'!G171-'1_Původní'!G171","v":0},{"$f":"'2_Upravený'!H171-'1_Původní'!H171","v":0},{"$f":"'2_Upravený'!I171-'1_Původní'!I171","v":0},{"$f":"'2_Upravený'!J171-'1_Původní'!J171","v":0},{"$f":"'2_Upravený'!K171-'1_Původní'!K171","v":-94584.156900000002},{"$f":"'2_Upravený'!L171-'1_Původní'!L171","v":0},{"$f":"'2_Upravený'!M171-'1_Původní'!M171","v":0},{"$f":"'2_Upravený'!N171-'1_Původní'!N171","v":0},{"$f":"'2_Upravený'!O171-'1_Původní'!O171","v":37145.400900000001},{"$f":"SUM(D171:O171)","v":-57438.756000000001}]
[null,{"$f":"IF('2_Upravený'!B172=\"\",\"\",'2_Upravený'!B172)","v":"8544"},{"$f":"IF('2_Upravený'!C172=\"\",\"\",'2_Upravený'!C172)","v":"MUDr. Jana Volejníková, Ph.D. - DK"},{"$f":"'2_Upravený'!D172-'1_Původní'!D172","v":0},{"$f":"'2_Upravený'!E172-'1_Původní'!E172","v":0},{"$f":"'2_Upravený'!F172-'1_Původní'!F172","v":0},{"$f":"'2_Upravený'!G172-'1_Původní'!G172","v":0},{"$f":"'2_Upravený'!H172-'1_Původní'!H172","v":0},{"$f":"'2_Upravený'!I172-'1_Původní'!I172","v":0},{"$f":"'2_Upravený'!J172-'1_Původní'!J172","v":0},{"$f":"'2_Upravený'!K172-'1_Původní'!K172","v":-257404.02710000001},{"$f":"'2_Upravený'!L172-'1_Původní'!L172","v":0},{"$f":"'2_Upravený'!M172-'1_Původní'!M172","v":0},{"$f":"'2_Upravený'!N172-'1_Původní'!N172","v":0},{"$f":"'2_Upravený'!O172-'1_Původní'!O172","v":29152.1613},{"$f":"SUM(D172:O172)","v":-228251.8658}]
[null,{"$f":"IF('2_Upravený'!B173=\"\",\"\",'2_Upravený'!B173)","v":"8551"},{"$f":"IF('2_Upravený'!C173=\"\",\"\",'2_Upravený'!C173)","v":"Doc. MUDr. Vladimír Študent, PhD. - UROL"},{"$f":"'2_Upravený'!D173-'1_Původní'!D173","v":0},{"$f":"'2_Upravený'!E173-'1_Původní'!E173","v":0},{"$f":"'2_Upravený'!F173-'1_Původní'!F173","v":0},{"$f":"'2_Upravený'!G173-'1_Původní'!G173","v":0},{"$f":"'2_Upravený'!H173-'1_Původní'!H173","v":0},{"$f":"'2_Upravený'!I173-'1_Původní'!I173","v":0},{"$f":"'2_Upravený'!J173-'1_Původní'!J173","v":0},{"$f":"'2_Upravený'!K173-'1_Původní'!K173","v":-152010.25219999999},{"$f":"'2_Upravený'!L173-'1_Původní'!L173","v":0},{"$f":"'2_Upravený'!M173-'1_Původní'!M173","v":0},{"$f":"'2_Upravený'!N173-'1_Původní'!N173","v":0},{"$f":"'2_Upravený'!O173-'1_Původní'!O173","v":35619.4139},-116390.83829999999]
[null,{"$f":"IF('2_Upravený'!B174=\"\",\"\",'2_Upravený'!B174)","v":"8552"},{"$f":"IF('2_Upravený'!C174=\"\",\"\",'2_Upravený'!C174)","v":"Doc. MUDr. Jiří Minařík, PhD. - HOK"},{"$f":"'2_Upravený'!D174-'1_Původní'!D174","v":0},{"$f":"'2_Upravený'!E174-'1_Původní'!E174","v":0},{"$f":"'2_Upravený'!F174-'1_Původní'!F174","v":0},{"$f":"'2_Upravený'!G174-'1_Původní'!G174","v":0},{"$f":"'2_Upravený'!H174-'1_Původní'!H174","v":0},{"$f":"'2_Upravený'!I174-'1_Původní'!I174","v":0},{"$f":"'2_Upravený'!J174-'1_Původní'!J174","v":0},{"$f":"'2_Upravený'!K174-'1_Původní'!K174","v":-31077.651600000001},{"$f":"'2_Upravený'!L174-'1_Původní'!L174","v":0},{"$f":"'2_Upravený'!M174-'1_Původní'!M174","v":0},{"$f":"'2_Upravený'!N174-'1_Původní'!N174","v":0},{"$f":"'2_Upravený'!O174-'1_Původní'!O174","v":0},-31077.651600000001]
[null,{"$f":"IF('2_Upravený'!B175=\"\",\"\",'2_Upravený'!B175)","v":"8553"},{"$f":"IF('2_Upravený'!C175=\"\",\"\",'2_Upravený'!C175)","v":"MUDr. Hana Študentová, Ph.D. - ONKO"},{"$f":"'2_Upravený'!D175-'1_Původní'!D175","v":0},{"$f":"'2_Upravený'!E175-'1_Původní'!E175","v":0},{"$f":"'2_Upravený'!F175-'1_Původní'!F175","v":0},{"$f":"'2_Upravený'!G175-'1_Původní'!G175","v":0},{"$f":"'2_Upravený'!H175-'1_Původní'!H175","v":0},{"$f":"'2_Upravený'!I175-'1_Původní'!I175","v":0},{"$f":"'2_Upravený'!J175-'1_Původní'!J175","v":-96610.960300000006},{"$f":"'2_Upravený'!K175-'1_Původní'!K175","v":0},{"$f":"'2_Upravený'!L175-'1_Původní'!L175","v":0},{"$f":"'2_Upravený'!M175-'1_Původní'!M175","v":0},{"$f":"'2_Upravený'!N175-'1_Původní'!N175","v":0},{"$f":"'2_Upravený'!O175-'1_Původní'!O175","v":1362.1267},-95248.833600000013]
[null,{"$f":"IF('2_Upravený'!B176=\"\",\"\",'2_Upravený'!B176)","v":"8555"},{"$f":"IF('2_Upravený'!C176=\"\",\"\",'2_Upravený'!C176)","v":"Doc. RNDr. Radek Vrtěl, PhD. - GENETIKA"},{"$f":"'2_Upravený'!D176-'1_Původní'!D176","v":0},{"$f":"'2_Upravený'!E176-'1_Původní'!E176","v":0},{"$f":"'2_Upravený'!F176-'1_Původní'!F176","v":0},{"$f":"'2_Upravený'!G176-'1_Původní'!G176","v":0},{"$f":"'2_Upravený'!H176-'1_Původní'!H176","v":0},{"$f":"'2_Upravený'!I176-'1_Původní'!I176","v":0},{"$f":"'2_Upravený'!J176-'1_Původní'!J176","v":0},{"$f":"'2_Upravený'!K176-'1_Původní'!K176","v":-272267.25170000002},{"$f":"'2_Upravený'!L176-'1_Původní'!L176","v":0},{"$f":"'2_Upravený'!M176-'1_Původní'!M176","v":0},{"$f":"'2_Upravený'!N176-'1_Původní'!N176","v":0},{"$f":"'2_Upravený'!O176-'1_Původní'!O176","v":1377.4426000000001},-270889.80910000001]
[null,{"$f":"IF('2_Upravený'!B177=\"\",\"\",'2_Upravený'!B177)","v":"8556"},{"$f":"IF('2_Upravený'!C177=\"\",\"\",'2_Upravený'!C177)","v":"MUDr. Tomáš Veverka, PhD. - NEUROL"},{"$f":"'2_Upravený'!D177-'1_Původní'!D177","v":-29868.386399999999},{"$f":"'2_Upravený'!E177-'1_Původní'!E177","v":0},{"$f":"'2_Upravený'!F177-'1_Původní'!F177","v":0},{"$f":"'2_Upravený'!G177-'1_Původní'!G177","v":0},{"$f":"'2_Upravený'!H177-'1_Původní'!H177","v":0},{"$f":"'2_Upravený'!I177-'1_Původní'!I177","v":0},{"$f":"'2_Upravený'!J177-'1_Původní'!J177","v":0},{"$f":"'2_Upravený'!K177-'1_Původní'!K177","v":-239162.79680000001},{"$f":"'2_Upravený'!L177-'1_Původní'!L177","v":0},{"$f":"'2_Upravený'!M177-'1_Původní'!M177","v":0},{"$f":"'2_Upravený'!N177-'1_Původní'!N177","v":0},{"$f":"'2_Upravený'!O177-'1_Původní'!O177","v":14224.1263},-254807.05690000003]
[null,{"$f":"IF('2_Upravený'!B178=\"\",\"\",'2_Upravený'!B178)","v":"8557"},{"$f":"IF('2_Upravený'!C178=\"\",\"\",'2_Upravený'!C178)","v":"MUDr. Petr Šantavý, PhD. - KARDIOCHIR"},{"$f":"'2_Upravený'!D178-'1_Původní'!D178","v":0},{"$f":"'2_Upravený'!E178-'1_Původní'!E178","v":0},{"$f":"'2_Upravený'!F178-'1_Původní'!F178","v":0},{"$f":"'2_Upravený'!G178-'1_Původní'!G178","v":0},{"$f":"'2_Upravený'!H178-'1_Původní'!H178","v":0},{"$f":"'2_Upravený'!I178-'1_Původní'!I178","v":0},{"$f":"'2_Upravený'!J178-'1_Původní'!J178","v":0},{"$f":"'2_Upravený'!K178-'1_Původní'!K178","v":-287130.47639999999},{"$f":"'2_Upravený'!L178-'1_Původní'!L178","v":0},{"$f":"'2_Upravený'!M178-'1_Původní'!M178","v":0},{"$f":"'2_Upravený'!N178-'1_Původní'!N178","v":0},{"$f":"'2_Upravený'!O178-'1_Původní'!O178","v":192.41120000000001},-286938.06520000001]
[null,{"$f":"IF('2_Upravený'!B179=\"\",\"\",'2_Upravený'!B179)","v":"8558"},{"$f":"IF('2_Upravený'!C179=\"\",\"\",'2_Upravený'!C179)","v":"MUDr. Filip Čtvrtlík, PhD. - RTG"},{"$f":"'2_Upravený'!D179-'1_Původní'!D179","v":0},{"$f":"'2_Upravený'!E179-'1_Původní'!E179","v":0},{"$f":"'2_Upravený'!F179-'1_Původní'!F179","v":0},{"$f":"'2_Upravený'!G179-'1_Původní'!G179","v":0},{"$f":"'2_Upravený'!H179-'1_Původní'!H179","v":0},{"$f":"'2_Upravený'!I179-'1_Původní'!I179","v":0},{"$f":"'2_Upravený'!J179-'1_Původní'!J179","v":0},{"$f":"'2_Upravený'!K179-'1_Původní'!K179","v":-224299.57209999999},{"$f":"'2_Upravený'!L179-'1_Původní'!L179","v":0},{"$f":"'2_Upravený'!M179-'1_Původní'!M179","v":0},{"$f":"'2_Upravený'!N179-'1_Původní'!N179","v":0},{"$f":"'2_Upravený'!O179-'1_Původní'!O179","v":38519.674899999998},-185779.89720000001]
[null,{"$f":"IF('2_Upravený'!B180=\"\",\"\",'2_Upravený'!B180)","v":"8559"},{"$f":"IF('2_Upravený'!C180=\"\",\"\",'2_Upravený'!C180)","v":"MUDr. JUDr. Dušan Klos, Ph.D. - I.CHIR"},{"$f":"'2_Upravený'!D180-'1_Původní'!D180","v":0},{"$f":"'2_Upravený'!E180-'1_Původní'!E180","v":0},{"$f":"'2_Upravený'!F180-'1_Původní'!F180","v":0},{"$f":"'2_Upravený'!G180-'1_Původní'!G180","v":0},{"$f":"'2_Upravený'!H180-'1_Původní'!H180","v":0},{"$f":"'2_Upravený'!I180-'1_Původní'!I180","v":521000},{"$f":"'2_Upravený'!J180-'1_Původní'!J180","v":0},{"$f":"'2_Upravený'!K180-'1_Původní'!K180","v":-351988.18400000001},{"$f":"'2_Upravený'!L180-'1_Původní'!L180","v":0},{"$f":"'2_Upravený'!M180-'1_Původní'!M180","v":0},{"$f":"'2_Upravený'!N180-'1_Původní'!N180","v":0},{"$f":"'2_Upravený'!O180-'1_Původní'!O180","v":1072.5708},170084.38679999998]
[null,{"$f":"IF('2_Upravený'!B181=\"\",\"\",'2_Upravený'!B181)","v":"8560"},{"$f":"IF('2_Upravený'!C181=\"\",\"\",'2_Upravený'!C181)","v":"Mgr. Lenka Kocourková - LEM"},{"$f":"'2_Upravený'!D181-'1_Původní'!D181","v":0},{"$f":"'2_Upravený'!E181-'1_Původní'!E181","v":0},{"$f":"'2_Upravený'!F181-'1_Původní'!F181","v":0},{"$f":"'2_Upravený'!G181-'1_Původní'!G181","v":0},{"$f":"'2_Upravený'!H181-'1_Původní'!H181","v":0},{"$f":"'2_Upravený'!I181-'1_Původní'!I181","v":212000},{"$f":"'2_Upravený'!J181-'1_Původní'!J181","v":0},{"$f":"'2_Upravený'!K181-'1_Původní'!K181","v":-217543.56090000001},{"$f":"'2_Upravený'!L181-'1_Původní'!L181","v":0},{"$f":"'2_Upravený'!M181-'1_Původní'!M181","v":0},{"$f":"'2_Upravený'!N181-'1_Původní'!N181","v":0},{"$f":"'2_Upravený'!O181-'1_Původní'!O181","v":641.44949999999994},-4902.1114000000116]
[null,{"$f":"IF('2_Upravený'!B182=\"\",\"\",'2_Upravený'!B182)","v":"8561"},{"$f":"IF('2_Upravený'!C182=\"\",\"\",'2_Upravený'!C182)","v":"MUDr. Ondřej Krystyník - III. IK"},{"$f":"'2_Upravený'!D182-'1_Původní'!D182","v":0},{"$f":"'2_Upravený'!E182-'1_Původní'!E182","v":0},{"$f":"'2_Upravený'!F182-'1_Původní'!F182","v":0},{"$f":"'2_Upravený'!G182-'1_Původní'!G182","v":0},{"$f":"'2_Upravený'!H182-'1_Původní'!H182","v":0},{"$f":"'2_Upravený'!I182-'1_Původní'!I182","v":729000},{"$f":"'2_Upravený'!J182-'1_Původní'!J182","v":0},{"$f":"'2_Upravený'!K182-'1_Původní'!K182","v":-485757.2059},{"$f":"'2_Upravený'!L182-'1_Původní'!L182","v":0},{"$f":"'2_Upravený'!M182-'1_Původní'!M182","v":0},{"$f":"'2_Upravený'!N182-'1_Původní'!N182","v":0},{"$f":"'2_Upravený'!O182-'1_Původní'!O182","v":15968.0622},259210.85629999998]
[null,{"$f":"IF('2_Upravený'!B183=\"\",\"\",'2_Upravený'!B183)","v":"8562"},{"$f":"IF('2_Upravený'!C183=\"\",\"\",'2_Upravený'!C183)","v":"Mgr. Taťána Štosová, Ph.D. - MIKRO"},{"$f":"'2_Upravený'!D183-'1_Původní'!D183","v":0},{"$f":"'2_Upravený'!E183-'1_Původní'!E183","v":0},{"$f":"'2_Upravený'!F183-'1_Původní'!F183","v":0},{"$f":"'2_Upravený'!G183-'1_Původní'!G183","v":0},{"$f":"'2_Upravený'!H183-'1_Původní'!H183","v":0},{"$f":"'2_Upravený'!I183-'1_Původní'!I183","v":98000},{"$f":"'2_Upravený'!J183-'1_Původní'!J183","v":0},{"$f":"'2_Upravený'!K183-'1_Původní'!K183","v":-133769.02189999999},{"$f":"'2_Upravený'!L183-'1_Původní'!L183","v":0},{"$f":"'2_Upravený'!M183-'1_Původní'!M183","v":0},{"$f":"'2_Upravený'!N183-'1_Původní'!N183","v":0},{"$f":"'2_Upravený'!O183-'1_Původní'!O183","v":19020.461800000001},-16748.560099999992]
[null,{"$f":"IF('2_Upravený'!B184=\"\",\"\",'2_Upravený'!B184)","v":"8563"},{"$f":"IF('2_Upravený'!C184=\"\",\"\",'2_Upravený'!C184)","v":"Doc. MUDr. Jan Minařík, Ph.D. - HOK"},{"$f":"'2_Upravený'!D184-'1_Původní'!D184","v":0},{"$f":"'2_Upravený'!E184-'1_Původní'!E184","v":0},{"$f":"'2_Upravený'!F184-'1_Původní'!F184","v":0},{"$f":"'2_Upravený'!G184-'1_Původní'!G184","v":0},{"$f":"'2_Upravený'!H184-'1_Původní'!H184","v":0},{"$f":"'2_Upravený'!I184-'1_Původní'!I184","v":311000},{"$f":"'2_Upravený'!J184-'1_Původní'!J184","v":0},{"$f":"'2_Upravený'!K184-'1_Původní'!K184","v":-210111.9486},{"$f":"'2_Upravený'!L184-'1_Původní'!L184","v":0},{"$f":"'2_Upravený'!M184-'1_Původní'!M184","v":0},{"$f":"'2_Upravený'!N184-'1_Původní'!N184","v":0},{"$f":"'2_Upravený'!O184-'1_Původní'!O184","v":1649.6963000000001},102537.74769999999]
[null,{"$f":"IF('2_Upravený'!B185=\"\",\"\",'2_Upravený'!B185)","v":"8564"},{"$f":"IF('2_Upravený'!C185=\"\",\"\",'2_Upravený'!C185)","v":"MUDr. Jan Přeček, Ph.D. - I.IK"},{"$f":"'2_Upravený'!D185-'1_Původní'!D185","v":0},{"$f":"'2_Upravený'!E185-'1_Původní'!E185","v":0},{"$f":"'2_Upravený'!F185-'1_Původní'!F185","v":0},{"$f":"'2_Upravený'!G185-'1_Původní'!G185","v":-41211.668400000002},{"$f":"'2_Upravený'!H185-'1_Původní'!H185","v":0},{"$f":"'2_Upravený'!I185-'1_Původní'!I185","v":61000},{"$f":"'2_Upravený'!J185-'1_Původní'!J185","v":0},{"$f":"'2_Upravený'!K185-'1_Původní'!K185","v":0},{"$f":"'2_Upravený'!L185-'1_Původní'!L185","v":0},{"$f":"'2_Upravený'!M185-'1_Původní'!M185","v":0},{"$f":"'2_Upravený'!N185-'1_Původní'!N185","v":0},{"$f":"'2_Upravený'!O185-'1_Původní'!O185","v":0},19788.331599999998]
[null,{"$f":"IF('2_Upravený'!B186=\"\",\"\",'2_Upravený'!B186)","v":"8565"},{"$f":"IF('2_Upravený'!C186=\"\",\"\",'2_Upravený'!C186)","v":"Prof. MUDr. Ing. Petr Hluštík, Ph.D. - NEUROL"},{"$f":"'2_Upravený'!D186-'1_Původní'!D186","v":-79805.1054},{"$f":"'2_Upravený'!E186-'1_Původní'!E186","v":0},{"$f":"'2_Upravený'!F186-'1_Původní'!F186","v":0},{"$f":"'2_Upravený'!G186-'1_Původní'!G186","v":0},{"$f":"'2_Upravený'!H186-'1_Původní'!H186","v":52992.506300000008},{"$f":"'2_Upravený'!I186-'1_Původní'!I186","v":0},{"$f":"'2_Upravený'!J186-'1_Původní'!J186","v":0},{"$f":"'2_Upravený'!K186-'1_Původní'!K186","v":0},{"$f":"'2_Upravený'!L186-'1_Původní'!L186","v":0},{"$f":"'2_Upravený'!M186-'1_Původní'!M186","v":0},{"$f":"'2_Upravený'!N186-'1_Původní'!N186","v":0},{"$f":"'2_Upravený'!O186-'1_Původní'!O186","v":105413.624},78601.024900000004]
[null,{"$f":"IF('2_Upravený'!B187=\"\",\"\",'2_Upravený'!B187)","v":"8566"},{"$f":"IF('2_Upravený'!C187=\"\",\"\",'2_Upravený'!C187)","v":"MUDr. Michaela Kaiserová - NEUROL"},{"$f":"'2_Upravený'!D187-'1_Původní'!D187","v":0},{"$f":"'2_Upravený'!E187-'1_Původní'!E187","v":0},{"$f":"'2_Upravený'!F187-'1_Původní'!F187","v":0},{"$f":"'2_Upravený'!G187-'1_Původní'!G187","v":0},{"$f":"'2_Upravený'!H187-'1_Původní'!H187","v":42496.253200000006},{"$f":"'2_Upravený'!I187-'1_Původní'!I187","v":0},{"$f":"'2_Upravený'!J187-'1_Původní'!J187","v":0},{"$f":"'2_Upravený'!K187-'1_Původní'!K187","v":0},{"$f":"'2_Upravený'!L187-'1_Původní'!L187","v":0},{"$f":"'2_Upravený'!M187-'1_Původní'!M187","v":0},{"$f":"'2_Upravený'!N187-'1_Původní'!N187","v":0},{"$f":"'2_Upravený'!O187-'1_Původní'!O187","v":23757.371500000001},66253.624700000015]
[null,{"$f":"IF('2_Upravený'!B188=\"\",\"\",'2_Upravený'!B188)","v":"8567"},{"$f":"IF('2_Upravený'!C188=\"\",\"\",'2_Upravený'!C188)","v":"MUDr. Jana Petřková, Ph.D. - I.IK"},{"$f":"'2_Upravený'!D188-'1_Původní'!D188","v":0},{"$f":"'2_Upravený'!E188-'1_Původní'!E188","v":0},{"$f":"'2_Upravený'!F188-'1_Původní'!F188","v":0},{"$f":"'2_Upravený'!G188-'1_Původní'!G188","v":0},{"$f":"'2_Upravený'!H188-'1_Původní'!H188","v":91000},{"$f":"'2_Upravený'!I188-'1_Původní'!I188","v":-120932.60060000001},{"$f":"'2_Upravený'!J188-'1_Původní'!J188","v":0},{"$f":"'2_Upravený'!K188-'1_Původní'!K188","v":0},{"$f":"'2_Upravený'!L188-'1_Původní'!L188","v":0},{"$f":"'2_Upravený'!M188-'1_Původní'!M188","v":0},{"$f":"'2_Upravený'!N188-'1_Původní'!N188","v":0},{"$f":"'2_Upravený'!O188-'1_Původní'!O188","v":821.34860000000003},-29111.252000000004]
[null,{"$f":"IF('2_Upravený'!B189=\"\",\"\",'2_Upravený'!B189)","v":"8568"},{"$f":"IF('2_Upravený'!C189=\"\",\"\",'2_Upravený'!C189)","v":"Prof. MUDr. Dagmar Pospíšilová, Ph.D. - DK"},{"$f":"'2_Upravený'!D189-'1_Původní'!D189","v":-6633.4503999999997},{"$f":"'2_Upravený'!E189-'1_Původní'!E189","v":0},{"$f":"'2_Upravený'!F189-'1_Původní'!F189","v":0},{"$f":"'2_Upravený'!G189-'1_Původní'!G189","v":0},{"$f":"'2_Upravený'!H189-'1_Původní'!H189","v":0},{"$f":"'2_Upravený'!I189-'1_Původní'!I189","v":53737.483399999997},{"$f":"'2_Upravený'!J189-'1_Původní'!J189","v":0},{"$f":"'2_Upravený'!K189-'1_Původní'!K189","v":0},{"$f":"'2_Upravený'!L189-'1_Původní'!L189","v":0},{"$f":"'2_Upravený'!M189-'1_Původní'!M189","v":0},{"$f":"'2_Upravený'!N189-'1_Původní'!N189","v":0},{"$f":"'2_Upravený'!O189-'1_Původní'!O189","v":23592.477599999998},70696.510599999994]
[null,{"$f":"IF('2_Upravený'!B190=\"\",\"\",'2_Upravený'!B190)","v":"8569"},{"$f":"IF('2_Upravený'!C190=\"\",\"\",'2_Upravený'!C190)","v":"MUDr. Přemysl Falt, Ph.D. - II.IK"},{"$f":"'2_Upravený'!D190-'1_Původní'!D190","v":0},{"$f":"'2_Upravený'!E190-'1_Původní'!E190","v":0},{"$f":"'2_Upravený'!F190-'1_Původní'!F190","v":0},{"$f":"'2_Upravený'!G190-'1_Původní'!G190","v":0},{"$f":"'2_Upravený'!H190-'1_Původní'!H190","v":-247945.61139999999},{"$f":"'2_Upravený'!I190-'1_Původní'!I190","v":136000},{"$f":"'2_Upravený'!J190-'1_Původní'!J190","v":0},{"$f":"'2_Upravený'!K190-'1_Původní'!K190","v":0},{"$f":"'2_Upravený'!L190-'1_Původní'!L190","v":0},{"$f":"'2_Upravený'!M190-'1_Původní'!M190","v":0},{"$f":"'2_Upravený'!N190-'1_Původní'!N190","v":0},{"$f":"'2_Upravený'!O190-'1_Původní'!O190","v":0},-111945.61139999999]
[null,{"$f":"IF('2_Upravený'!B191=\"\",\"\",'2_Upravený'!B191)","v":"8570"},{"$f":"IF('2_Upravený'!C191=\"\",\"\",'2_Upravený'!C191)","v":"Prof. MUDr. Bohuslav Melichar, Ph.D. - ONKO"},{"$f":"'2_Upravený'!D191-'1_Původní'!D191","v":-126075.9587},{"$f":"'2_Upravený'!E191-'1_Původní'!E191","v":0},{"$f":"'2_Upravený'!F191-'1_Původní'!F191","v":0},{"$f":"'2_Upravený'!G191-'1_Původní'!G191","v":0},{"$f":"'2_Upravený'!H191-'1_Původní'!H191","v":0},{"$f":"'2_Upravený'!I191-'1_Původní'!I191","v":0},{"$f":"'2_Upravený'!J191-'1_Původní'!J191","v":-196599.92619999999},{"$f":"'2_Upravený'!K191-'1_Původní'!K191","v":0},{"$f":"'2_Upravený'!L191-'1_Původní'!L191","v":0},{"$f":"'2_Upravený'!M191-'1_Původní'!M191","v":0},{"$f":"'2_Upravený'!N191-'1_Původní'!N191","v":0},{"$f":"'2_Upravený'!O191-'1_Původní'!O191","v":207979.26500000001},-114696.61989999999]
[null,{"$f":"IF('2_Upravený'!B192=\"\",\"\",'2_Upravený'!B192)","v":"8571"},{"$f":"IF('2_Upravený'!C192=\"\",\"\",'2_Upravený'!C192)","v":"MUDr. Tomáš Skála, Ph.D., FESC - I.IK"},{"$f":"'2_Upravený'!D192-'1_Původní'!D192","v":-23219.633600000001},{"$f":"'2_Upravený'!E192-'1_Původní'!E192","v":0},{"$f":"'2_Upravený'!F192-'1_Původní'!F192","v":0},{"$f":"'2_Upravený'!G192-'1_Původní'!G192","v":-334422.55489999999},{"$f":"'2_Upravený'!H192-'1_Původní'!H192","v":79000},{"$f":"'2_Upravený'!I192-'1_Původní'!I192","v":0},{"$f":"'2_Upravený'!J192-'1_Původní'!J192","v":0},{"$f":"'2_Upravený'!K192-'1_Původní'!K192","v":0},{"$f":"'2_Upravený'!L192-'1_Původní'!L192","v":0},{"$f":"'2_Upravený'!M192-'1_Původní'!M192","v":0},{"$f":"'2_Upravený'!N192-'1_Původní'!N192","v":0},{"$f":"'2_Upravený'!O192-'1_Původní'!O192","v":22123.335599999999},-256518.8529]
[null,{"$f":"IF('2_Upravený'!B193=\"\",\"\",'2_Upravený'!B193)","v":"8572"},{"$f":"IF('2_Upravený'!C193=\"\",\"\",'2_Upravený'!C193)","v":"Grant: Doc. MUDr. Petr Šantavý, Ph.D. - KARDIOCHIR"},{"$f":"'2_Upravený'!D193-'1_Původní'!D193","v":0},{"$f":"'2_Upravený'!E193-'1_Původní'!E193","v":0},{"$f":"'2_Upravený'!F193-'1_Původní'!F193","v":0},{"$f":"'2_Upravený'!G193-'1_Původní'!G193","v":0},{"$f":"'2_Upravený'!H193-'1_Původní'!H193","v":337000},{"$f":"'2_Upravený'!I193-'1_Původní'!I193","v":-291184.08309999999},{"$f":"'2_Upravený'!J193-'1_Původní'!J193","v":0},{"$f":"'2_Upravený'!K193-'1_Původní'!K193","v":0},{"$f":"'2_Upravený'!L193-'1_Původní'!L193","v":0},{"$f":"'2_Upravený'!M193-'1_Původní'!M193","v":0},{"$f":"'2_Upravený'!N193-'1_Původní'!N193","v":0},{"$f":"'2_Upravený'!O193-'1_Původní'!O193","v":0},45815.916900000011]
[null,{"$f":"IF('2_Upravený'!B194=\"\",\"\",'2_Upravený'!B194)","v":"8573"},{"$f":"IF('2_Upravený'!C194=\"\",\"\",'2_Upravený'!C194)","v":"Grant: MUDr. Jan Přeček, PhD. - I.IK"},{"$f":"'2_Upravený'!D194-'1_Původní'!D194","v":0},{"$f":"'2_Upravený'!E194-'1_Původní'!E194","v":0},{"$f":"'2_Upravený'!F194-'1_Původní'!F194","v":0},{"$f":"'2_Upravený'!G194-'1_Původní'!G194","v":0},{"$f":"'2_Upravený'!H194-'1_Původní'!H194","v":29000},{"$f":"'2_Upravený'!I194-'1_Původní'!I194","v":0},{"$f":"'2_Upravený'!J194-'1_Původní'!J194","v":-12836.4213},{"$f":"'2_Upravený'!K194-'1_Původní'!K194","v":0},{"$f":"'2_Upravený'!L194-'1_Původní'!L194","v":0},{"$f":"'2_Upravený'!M194-'1_Původní'!M194","v":0},{"$f":"'2_Upravený'!N194-'1_Původní'!N194","v":0},{"$f":"'2_Upravený'!O194-'1_Původní'!O194","v":0},16163.5787]
[null,{"$f":"IF('2_Upravený'!B195=\"\",\"\",'2_Upravený'!B195)","v":"8574"},{"$f":"IF('2_Upravený'!C195=\"\",\"\",'2_Upravený'!C195)","v":"Grant: Doc. MUDr. Kateřina Menšíková, PhD. - NEURO"},{"$f":"'2_Upravený'!D195-'1_Původní'!D195","v":0},{"$f":"'2_Upravený'!E195-'1_Původní'!E195","v":0},{"$f":"'2_Upravený'!F195-'1_Původní'!F195","v":0},{"$f":"'2_Upravený'!G195-'1_Původní'!G195","v":0},{"$f":"'2_Upravený'!H195-'1_Původní'!H195","v":506000},{"$f":"'2_Upravený'!I195-'1_Původní'!I195","v":-193221.92060000001},{"$f":"'2_Upravený'!J195-'1_Původní'!J195","v":0},{"$f":"'2_Upravený'!K195-'1_Původní'!K195","v":0},{"$f":"'2_Upravený'!L195-'1_Původní'!L195","v":0},{"$f":"'2_Upravený'!M195-'1_Původní'!M195","v":0},{"$f":"'2_Upravený'!N195-'1_Původní'!N195","v":0},{"$f":"'2_Upravený'!O195-'1_Původní'!O195","v":3663.0686999999998},316441.14809999999]
[null,{"$f":"IF('2_Upravený'!B196=\"\",\"\",'2_Upravený'!B196)","v":"8575"},{"$f":"IF('2_Upravený'!C196=\"\",\"\",'2_Upravený'!C196)","v":"Grant: Doc. MUDr. Miroslav Vaverka, CSc. - NEUROCH"},{"$f":"'2_Upravený'!D196-'1_Původní'!D196","v":0},{"$f":"'2_Upravený'!E196-'1_Původní'!E196","v":0},{"$f":"'2_Upravený'!F196-'1_Původní'!F196","v":0},{"$f":"'2_Upravený'!G196-'1_Původní'!G196","v":0},{"$f":"'2_Upravený'!H196-'1_Původní'!H196","v":0},{"$f":"'2_Upravený'!I196-'1_Původní'!I196","v":80000},{"$f":"'2_Upravený'!J196-'1_Původní'!J196","v":0},{"$f":"'2_Upravený'!K196-'1_Původní'!K196","v":-41211.668400000002},{"$f":"'2_Upravený'!L196-'1_Původní'!L196","v":0},{"$f":"'2_Upravený'!M196-'1_Původní'!M196","v":0},{"$f":"'2_Upravený'!N196-'1_Původní'!N196","v":0},{"$f":"'2_Upravený'!O196-'1_Původní'!O196","v":18916.831399999999},57705.163]
[null,{"$f":"IF('2_Upravený'!B197=\"\",\"\",'2_Upravený'!B197)","v":"8576"},{"$f":"IF('2_Upravený'!C197=\"\",\"\",'2_Upravený'!C197)","v":"Grant: MUDr. Vladislav Raclavský, PhD. - MIKRO"},{"$f":"'2_Upravený'!D197-'1_Původní'!D197","v":0},{"$f":"'2_Upravený'!E197-'1_Původní'!E197","v":0},{"$f":"'2_Upravený'!F197-'1_Původní'!F197","v":0},{"$f":"'2_Upravený'!G197-'1_Původní'!G197","v":0},{"$f":"'2_Upravený'!H197-'1_Původní'!H197","v":0},{"$f":"'2_Upravený'!I197-'1_Původní'!I197","v":211000},{"$f":"'2_Upravený'!J197-'1_Původní'!J197","v":0},{"$f":"'2_Upravený'!K197-'1_Původní'!K197","v":-67560.112099999998},{"$f":"'2_Upravený'!L197-'1_Původní'!L197","v":0},{"$f":"'2_Upravený'!M197-'1_Původní'!M197","v":0},{"$f":"'2_Upravený'!N197-'1_Původní'!N197","v":0},{"$f":"'2_Upravený'!O197-'1_Původní'!O197","v":0.94579999999999997},143440.83369999999]
[null,{"$f":"IF('2_Upravený'!B198=\"\",\"\",'2_Upravený'!B198)","v":"8577"},{"$f":"IF('2_Upravený'!C198=\"\",\"\",'2_Upravený'!C198)","v":"Grant: Prof. MUDr. Bohuslav Melichar, Ph.D. - ONKO"},{"$f":"'2_Upravený'!D198-'1_Původní'!D198","v":0},{"$f":"'2_Upravený'!E198-'1_Původní'!E198","v":0},{"$f":"'2_Upravený'!F198-'1_Původní'!F198","v":0},{"$f":"'2_Upravený'!G198-'1_Původní'!G198","v":0},{"$f":"'2_Upravený'!H198-'1_Původní'!H198","v":0},{"$f":"'2_Upravený'!I198-'1_Původní'!I198","v":100000},{"$f":"'2_Upravený'!J198-'1_Původní'!J198","v":0},{"$f":"'2_Upravený'!K198-'1_Původní'!K198","v":-35806.859400000001},{"$f":"'2_Upravený'!L198-'1_Původní'!L198","v":0},{"$f":"'2_Upravený'!M198-'1_Původní'!M198","v":0},{"$f":"'2_Upravený'!N198-'1_Původní'!N198","v":0},{"$f":"'2_Upravený'!O198-'1_Původní'!O198","v":0},64193.140599999999]
[null,{"$f":"IF('2_Upravený'!B199=\"\",\"\",'2_Upravený'!B199)","v":"8578"},{"$f":"IF('2_Upravený'!C199=\"\",\"\",'2_Upravený'!C199)","v":"Grant: Prof. MUDr. Mgr. Milan Raška, PhD. - IMUNO"},{"$f":"'2_Upravený'!D199-'1_Původní'!D199","v":0},{"$f":"'2_Upravený'!E199-'1_Původní'!E199","v":0},{"$f":"'2_Upravený'!F199-'1_Původní'!F199","v":0},{"$f":"'2_Upravený'!G199-'1_Původní'!G199","v":0},{"$f":"'2_Upravený'!H199-'1_Původní'!H199","v":130000},{"$f":"'2_Upravený'!I199-'1_Původní'!I199","v":0},{"$f":"'2_Upravený'!J199-'1_Původní'!J199","v":0},{"$f":"'2_Upravený'!K199-'1_Původní'!K199","v":-67560.112099999998},{"$f":"'2_Upravený'!L199-'1_Původní'!L199","v":0},{"$f":"'2_Upravený'!M199-'1_Původní'!M199","v":0},{"$f":"'2_Upravený'!N199-'1_Původní'!N199","v":0},{"$f":"'2_Upravený'!O199-'1_Původní'!O199","v":31753.5635},94193.451400000005]
[null,{"$f":"IF('2_Upravený'!B200=\"\",\"\",'2_Upravený'!B200)","v":"8579"},{"$f":"IF('2_Upravený'!C200=\"\",\"\",'2_Upravený'!C200)","v":"Grant: Prof. MUDr. Dagmar Pospíšilová, PhD. - DK"},{"$f":"'2_Upravený'!D200-'1_Původní'!D200","v":0},{"$f":"'2_Upravený'!E200-'1_Původní'!E200","v":0},{"$f":"'2_Upravený'!F200-'1_Původní'!F200","v":0},{"$f":"'2_Upravený'!G200-'1_Původní'!G200","v":0},{"$f":"'2_Upravený'!H200-'1_Původní'!H200","v":243000},{"$f":"'2_Upravený'!I200-'1_Původní'!I200","v":0},{"$f":"'2_Upravený'!J200-'1_Původní'!J200","v":0},{"$f":"'2_Upravený'!K200-'1_Původní'!K200","v":-86476.943499999994},{"$f":"'2_Upravený'!L200-'1_Původní'!L200","v":0},{"$f":"'2_Upravený'!M200-'1_Původní'!M200","v":0},{"$f":"'2_Upravený'!N200-'1_Původní'!N200","v":0},{"$f":"'2_Upravený'!O200-'1_Původní'!O200","v":27096.6044},183619.66090000002]
[null,{"$f":"IF('2_Upravený'!B201=\"\",\"\",'2_Upravený'!B201)","v":"8580"},{"$f":"IF('2_Upravený'!C201=\"\",\"\",'2_Upravený'!C201)","v":"Grant: Doc. MUDr. Martin Doležel, PhD. - ONKOL"},{"$f":"'2_Upravený'!D201-'1_Původní'!D201","v":0},{"$f":"'2_Upravený'!E201-'1_Původní'!E201","v":0},{"$f":"'2_Upravený'!F201-'1_Původní'!F201","v":0},{"$f":"'2_Upravený'!G201-'1_Původní'!G201","v":162000},{"$f":"'2_Upravený'!H201-'1_Původní'!H201","v":0},{"$f":"'2_Upravený'!I201-'1_Původní'!I201","v":0},{"$f":"'2_Upravený'!J201-'1_Původní'!J201","v":0},{"$f":"'2_Upravený'!K201-'1_Původní'!K201","v":0},{"$f":"'2_Upravený'!L201-'1_Původní'!L201","v":0},{"$f":"'2_Upravený'!M201-'1_Původní'!M201","v":0},{"$f":"'2_Upravený'!N201-'1_Původní'!N201","v":0},{"$f":"'2_Upravený'!O201-'1_Původní'!O201","v":0},162000]
[null,{"$f":"IF('2_Upravený'!B202=\"\",\"\",'2_Upravený'!B202)","v":"8581"},{"$f":"IF('2_Upravený'!C202=\"\",\"\",'2_Upravený'!C202)","v":"Grant: Doc. MUDr. Ondřej Urban, PhD. - II. IK"},{"$f":"'2_Upravený'!D202-'1_Původní'!D202","v":0},{"$f":"'2_Upravený'!E202-'1_Původní'!E202","v":0},{"$f":"'2_Upravený'!F202-'1_Původní'!F202","v":0},{"$f":"'2_Upravený'!G202-'1_Původní'!G202","v":153000},{"$f":"'2_Upravený'!H202-'1_Původní'!H202","v":0},{"$f":"'2_Upravený'!I202-'1_Původní'!I202","v":0},{"$f":"'2_Upravený'!J202-'1_Původní'!J202","v":0},{"$f":"'2_Upravený'!K202-'1_Původní'!K202","v":0},{"$f":"'2_Upravený'!L202-'1_Původní'!L202","v":0},{"$f":"'2_Upravený'!M202-'1_Původní'!M202","v":0},{"$f":"'2_Upravený'!N202-'1_Původní'!N202","v":0},{"$f":"'2_Upravený'!O202-'1_Původní'!O202","v":0},153000]
[null,{"$f":"IF('2_Upravený'!B203=\"\",\"\",'2_Upravený'!B203)","v":"8582"},{"$f":"IF('2_Upravený'!C203=\"\",\"\",'2_Upravený'!C203)","v":"Grant: MUDr. Tomáš Skála, PhD. FESC - I. IK"},{"$f":"'2_Upravený'!D203-'1_Původní'!D203","v":0},{"$f":"'2_Upravený'!E203-'1_Původní'!E203","v":0},{"$f":"'2_Upravený'!F203-'1_Původní'!F203","v":0},{"$f":"'2_Upravený'!G203-'1_Původní'!G203","v":57000},{"$f":"'2_Upravený'!H203-'1_Původní'!H203","v":0},{"$f":"'2_Upravený'!I203-'1_Původní'!I203","v":0},{"$f":"'2_Upravený'!J203-'1_Původní'!J203","v":0},{"$f":"'2_Upravený'!K203-'1_Původní'!K203","v":0},{"$f":"'2_Upravený'!L203-'1_Původní'!L203","v":0},{"$f":"'2_Upravený'!M203-'1_Původní'!M203","v":0},{"$f":"'2_Upravený'!N203-'1_Původní'!N203","v":0},{"$f":"'2_Upravený'!O203-'1_Původní'!O203","v":0},57000]
[null,{"$f":"IF('2_Upravený'!B204=\"\",\"\",'2_Upravený'!B204)","v":""},{"$f":"IF('2_Upravený'!C204=\"\",\"\",'2_Upravený'!C204)","v":""},{"$f":"'2_Upravený'!D204-'1_Původní'!D204","v":0},{"$f":"'2_Upravený'!E204-'1_Původní'!E204","v":0},{"$f":"'2_Upravený'!F204-'1_Původní'!F204","v":0},{"$f":"'2_Upravený'!G204-'1_Původní'!G204","v":0},{"$f":"'2_Upravený'!H204-'1_Původní'!H204","v":0},{"$f":"'2_Upravený'!I204-'1_Původní'!I204","v":0},{"$f":"'2_Upravený'!J204-'1_Původní'!J204","v":0},{"$f":"'2_Upravený'!K204-'1_Původní'!K204","v":0},{"$f":"'2_Upravený'!L204-'1_Původní'!L204","v":0},{"$f":"'2_Upravený'!M204-'1_Původní'!M204","v":0},{"$f":"'2_Upravený'!N204-'1_Původní'!N204","v":0},{"$f":"'2_Upravený'!O204-'1_Původní'!O204","v":0},0]
[]
[67102002,"Transfery jiného poskytovatele - VaV mzdové",null,{"$f":"SUM(D240:D240)","v":0},0,0,0,0,0,0,0,0,0,0,0,0]
[null,{"$f":"IF('2_Upravený'!B207=\"\",\"\",'2_Upravený'!B207)","v":"8542"},{"$f":"IF('2_Upravený'!C207=\"\",\"\",'2_Upravený'!C207)","v":"Prof. MUDr. Jiří Ehrmann, Ph.D. - PATOL"},{"$f":"'2_Upravený'!D207-'1_Původní'!D207","v":0},{"$f":"'2_Upravený'!E207-'1_Původní'!E207","v":0},{"$f":"'2_Upravený'!F207-'1_Původní'!F207","v":0},{"$f":"'2_Upravený'!G207-'1_Původní'!G207","v":0},{"$f":"'2_Upravený'!H207-'1_Původní'!H207","v":0},{"$f":"'2_Upravený'!I207-'1_Původní'!I207","v":0},{"$f":"'2_Upravený'!J207-'1_Původní'!J207","v":0},{"$f":"'2_Upravený'!K207-'1_Původní'!K207","v":-263537.41619999998},{"$f":"'2_Upravený'!L207-'1_Původní'!L207","v":0},{"$f":"'2_Upravený'!M207-'1_Původní'!M207","v":0},{"$f":"'2_Upravený'!N207-'1_Původní'!N207","v":0},{"$f":"'2_Upravený'!O207-'1_Původní'!O207","v":9852.01},{"$f":"SUM(D207:O207)","v":-253685.40619999997}]
[null,{"$f":"IF('2_Upravený'!B208=\"\",\"\",'2_Upravený'!B208)","v":"8544"},{"$f":"IF('2_Upravený'!C208=\"\",\"\",'2_Upravený'!C208)","v":"MUDr. Jana Volejníková, Ph.D. - DK"},{"$f":"'2_Upravený'!D208-'1_Původní'!D208","v":0},{"$f":"'2_Upravený'!E208-'1_Původní'!E208","v":0},{"$f":"'2_Upravený'!F208-'1_Původní'!F208","v":0},{"$f":"'2_Upravený'!G208-'1_Původní'!G208","v":0},{"$f":"'2_Upravený'!H208-'1_Původní'!H208","v":0},{"$f":"'2_Upravený'!I208-'1_Původní'!I208","v":0},{"$f":"'2_Upravený'!J208-'1_Původní'!J208","v":0},{"$f":"'2_Upravený'!K208-'1_Původní'!K208","v":-204973.546},{"$f":"'2_Upravený'!L208-'1_Původní'!L208","v":0},{"$f":"'2_Upravený'!M208-'1_Původní'!M208","v":0},{"$f":"'2_Upravený'!N208-'1_Původní'!N208","v":0},{"$f":"'2_Upravený'!O208-'1_Původní'!O208","v":26868.153999999999},{"$f":"SUM(D208:O208)","v":-178105.39199999999}]
[null,{"$f":"IF('2_Upravený'!B209=\"\",\"\",'2_Upravený'!B209)","v":"8551"},{"$f":"IF('2_Upravený'!C209=\"\",\"\",'2_Upravený'!C209)","v":"Doc. MUDr. Vladimír Študent, PhD. - UROL"},{"$f":"'2_Upravený'!D209-'1_Původní'!D209","v":0},{"$f":"'2_Upravený'!E209-'1_Původní'!E209","v":0},{"$f":"'2_Upravený'!F209-'1_Původní'!F209","v":0},{"$f":"'2_Upravený'!G209-'1_Původní'!G209","v":0},{"$f":"'2_Upravený'!H209-'1_Původní'!H209","v":0},{"$f":"'2_Upravený'!I209-'1_Původní'!I209","v":0},{"$f":"'2_Upravený'!J209-'1_Původní'!J209","v":0},{"$f":"'2_Upravený'!K209-'1_Původní'!K209","v":-337929.35960000003},{"$f":"'2_Upravený'!L209-'1_Původní'!L209","v":0},{"$f":"'2_Upravený'!M209-'1_Původní'!M209","v":0},{"$f":"'2_Upravený'!N209-'1_Původní'!N209","v":0},{"$f":"'2_Upravený'!O209-'1_Původní'!O209","v":1.6857},-337927.67390000005]
[null,{"$f":"IF('2_Upravený'!B210=\"\",\"\",'2_Upravený'!B210)","v":"8552"},{"$f":"IF('2_Upravený'!C210=\"\",\"\",'2_Upravený'!C210)","v":"Doc. MUDr. Jiří Minařík, PhD. - HOK"},{"$f":"'2_Upravený'!D210-'1_Původní'!D210","v":0},{"$f":"'2_Upravený'!E210-'1_Původní'!E210","v":0},{"$f":"'2_Upravený'!F210-'1_Původní'!F210","v":0},{"$f":"'2_Upravený'!G210-'1_Původní'!G210","v":0},{"$f":"'2_Upravený'!H210-'1_Původní'!H210","v":0},{"$f":"'2_Upravený'!I210-'1_Původní'!I210","v":0},{"$f":"'2_Upravený'!J210-'1_Původní'!J210","v":0},{"$f":"'2_Upravený'!K210-'1_Původní'!K210","v":-195476.70209999999},{"$f":"'2_Upravený'!L210-'1_Původní'!L210","v":0},{"$f":"'2_Upravený'!M210-'1_Původní'!M210","v":0},{"$f":"'2_Upravený'!N210-'1_Původní'!N210","v":0},{"$f":"'2_Upravený'!O210-'1_Původní'!O210","v":0},-195476.70209999999]
[null,{"$f":"IF('2_Upravený'!B211=\"\",\"\",'2_Upravený'!B211)","v":"8553"},{"$f":"IF('2_Upravený'!C211=\"\",\"\",'2_Upravený'!C211)","v":"MUDr. Hana Študentová, Ph.D. - ONKO"},{"$f":"'2_Upravený'!D211-'1_Původní'!D211","v":0},{"$f":"'2_Upravený'!E211-'1_Původní'!E211","v":0},{"$f":"'2_Upravený'!F211-'1_Původní'!F211","v":0},{"$f":"'2_Upravený'!G211-'1_Původní'!G211","v":0},{"$f":"'2_Upravený'!H211-'1_Původní'!H211","v":0},{"$f":"'2_Upravený'!I211-'1_Původní'!I211","v":0},{"$f":"'2_Upravený'!J211-'1_Původní'!J211","v":-432106.39419999998},{"$f":"'2_Upravený'!K211-'1_Původní'!K211","v":0},{"$f":"'2_Upravený'!L211-'1_Původní'!L211","v":0},{"$f":"'2_Upravený'!M211-'1_Původní'!M211","v":0},{"$f":"'2_Upravený'!N211-'1_Původní'!N211","v":0},{"$f":"'2_Upravený'!O211-'1_Původní'!O211","v":5104.9493000000002},-427001.4449]
[null,{"$f":"IF('2_Upravený'!B212=\"\",\"\",'2_Upravený'!B212)","v":"8555"},{"$f":"IF('2_Upravený'!C212=\"\",\"\",'2_Upravený'!C212)","v":"Doc. RNDr. Radek Vrtěl, PhD. - GENETIKA"},{"$f":"'2_Upravený'!D212-'1_Původní'!D212","v":0},{"$f":"'2_Upravený'!E212-'1_Původní'!E212","v":0},{"$f":"'2_Upravený'!F212-'1_Původní'!F212","v":0},{"$f":"'2_Upravený'!G212-'1_Původní'!G212","v":0},{"$f":"'2_Upravený'!H212-'1_Původní'!H212","v":0},{"$f":"'2_Upravený'!I212-'1_Původní'!I212","v":0},{"$f":"'2_Upravený'!J212-'1_Původní'!J212","v":0},{"$f":"'2_Upravený'!K212-'1_Původní'!K212","v":-477216.40240000002},{"$f":"'2_Upravený'!L212-'1_Původní'!L212","v":0},{"$f":"'2_Upravený'!M212-'1_Původní'!M212","v":0},{"$f":"'2_Upravený'!N212-'1_Původní'!N212","v":0},{"$f":"'2_Upravený'!O212-'1_Původní'!O212","v":0},-477216.40240000002]
[null,{"$f":"IF('2_Upravený'!B213=\"\",\"\",'2_Upravený'!B213)","v":"8556"},{"$f":"IF('2_Upravený'!C213=\"\",\"\",'2_Upravený'!C213)","v":"MUDr. Tomáš Veverka, PhD. - NEUROL"},{"$f":"'2_Upravený'!D213-'1_Původní'!D213","v":0},{"$f":"'2_Upravený'!E213-'1_Původní'!E213","v":0},{"$f":"'2_Upravený'!F213-'1_Původní'!F213","v":0},{"$f":"'2_Upravený'!G213-'1_Původní'!G213","v":0},{"$f":"'2_Upravený'!H213-'1_Původní'!H213","v":0},{"$f":"'2_Upravený'!I213-'1_Původní'!I213","v":0},{"$f":"'2_Upravený'!J213-'1_Původní'!J213","v":0},{"$f":"'2_Upravený'!K213-'1_Původní'!K213","v":-565062.20779999997},{"$f":"'2_Upravený'!L213-'1_Původní'!L213","v":0},{"$f":"'2_Upravený'!M213-'1_Původní'!M213","v":0},{"$f":"'2_Upravený'!N213-'1_Původní'!N213","v":0},{"$f":"'2_Upravený'!O213-'1_Původní'!O213","v":25021.1603},-540041.04749999999]
[null,{"$f":"IF('2_Upravený'!B214=\"\",\"\",'2_Upravený'!B214)","v":"8557"},{"$f":"IF('2_Upravený'!C214=\"\",\"\",'2_Upravený'!C214)","v":"MUDr. Petr Šantavý, PhD. - KARDIOCHIR"},{"$f":"'2_Upravený'!D214-'1_Původní'!D214","v":0},{"$f":"'2_Upravený'!E214-'1_Původní'!E214","v":0},{"$f":"'2_Upravený'!F214-'1_Původní'!F214","v":0},{"$f":"'2_Upravený'!G214-'1_Původní'!G214","v":0},{"$f":"'2_Upravený'!H214-'1_Původní'!H214","v":0},{"$f":"'2_Upravený'!I214-'1_Původní'!I214","v":0},{"$f":"'2_Upravený'!J214-'1_Původní'!J214","v":0},{"$f":"'2_Upravený'!K214-'1_Původní'!K214","v":-356923.04719999997},{"$f":"'2_Upravený'!L214-'1_Původní'!L214","v":0},{"$f":"'2_Upravený'!M214-'1_Původní'!M214","v":0},{"$f":"'2_Upravený'!N214-'1_Původní'!N214","v":0},{"$f":"'2_Upravený'!O214-'1_Původní'!O214","v":3168.3528999999999},-353754.69429999997]
[null,{"$f":"IF('2_Upravený'!B215=\"\",\"\",'2_Upravený'!B215)","v":"8558"},{"$f":"IF('2_Upravený'!C215=\"\",\"\",'2_Upravený'!C215)","v":"MUDr. Filip Čtvrtlík, PhD. - RTG"},{"$f":"'2_Upravený'!D215-'1_Původní'!D215","v":0},{"$f":"'2_Upravený'!E215-'1_Původní'!E215","v":0},{"$f":"'2_Upravený'!F215-'1_Původní'!F215","v":0},{"$f":"'2_Upravený'!G215-'1_Původní'!G215","v":0},{"$f":"'2_Upravený'!H215-'1_Původní'!H215","v":0},{"$f":"'2_Upravený'!I215-'1_Původní'!I215","v":0},{"$f":"'2_Upravený'!J215-'1_Původní'!J215","v":0},{"$f":"'2_Upravený'!K215-'1_Původní'!K215","v":-642619.76569999999},{"$f":"'2_Upravený'!L215-'1_Původní'!L215","v":0},{"$f":"'2_Upravený'!M215-'1_Původní'!M215","v":0},{"$f":"'2_Upravený'!N215-'1_Původní'!N215","v":0},{"$f":"'2_Upravený'!O215-'1_Původní'!O215","v":0},-642619.76569999999]
[null,{"$f":"IF('2_Upravený'!B216=\"\",\"\",'2_Upravený'!B216)","v":"8559"},{"$f":"IF('2_Upravený'!C216=\"\",\"\",'2_Upravený'!C216)","v":"MUDr. JUDr. Dušan Klos, Ph.D. - I.CHIR"},{"$f":"'2_Upravený'!D216-'1_Původní'!D216","v":0},{"$f":"'2_Upravený'!E216-'1_Původní'!E216","v":0},{"$f":"'2_Upravený'!F216-'1_Původní'!F216","v":0},{"$f":"'2_Upravený'!G216-'1_Původní'!G216","v":0},{"$f":"'2_Upravený'!H216-'1_Původní'!H216","v":0},{"$f":"'2_Upravený'!I216-'1_Původní'!I216","v":783000},{"$f":"'2_Upravený'!J216-'1_Původní'!J216","v":0},{"$f":"'2_Upravený'!K216-'1_Původní'!K216","v":-619669.05980000005},{"$f":"'2_Upravený'!L216-'1_Původní'!L216","v":0},{"$f":"'2_Upravený'!M216-'1_Původní'!M216","v":0},{"$f":"'2_Upravený'!N216-'1_Původní'!N216","v":0},{"$f":"'2_Upravený'!O216-'1_Původní'!O216","v":11815.205400000001},175146.14559999996]
[null,{"$f":"IF('2_Upravený'!B217=\"\",\"\",'2_Upravený'!B217)","v":"8560"},{"$f":"IF('2_Upravený'!C217=\"\",\"\",'2_Upravený'!C217)","v":"Mgr. Lenka Kocourková - LEM"},{"$f":"'2_Upravený'!D217-'1_Původní'!D217","v":0},{"$f":"'2_Upravený'!E217-'1_Původní'!E217","v":0},{"$f":"'2_Upravený'!F217-'1_Původní'!F217","v":0},{"$f":"'2_Upravený'!G217-'1_Původní'!G217","v":0},{"$f":"'2_Upravený'!H217-'1_Původní'!H217","v":0},{"$f":"'2_Upravený'!I217-'1_Původní'!I217","v":221000},{"$f":"'2_Upravený'!J217-'1_Původní'!J217","v":0},{"$f":"'2_Upravený'!K217-'1_Původní'!K217","v":-208139.1606},{"$f":"'2_Upravený'!L217-'1_Původní'!L217","v":0},{"$f":"'2_Upravený'!M217-'1_Původní'!M217","v":0},{"$f":"'2_Upravený'!N217-'1_Původní'!N217","v":0},{"$f":"'2_Upravený'!O217-'1_Původní'!O217","v":5392.9964},18253.835799999997]
[null,{"$f":"IF('2_Upravený'!B218=\"\",\"\",'2_Upravený'!B218)","v":"8561"},{"$f":"IF('2_Upravený'!C218=\"\",\"\",'2_Upravený'!C218)","v":"MUDr. Ondřej Krystyník - III. IK"},{"$f":"'2_Upravený'!D218-'1_Původní'!D218","v":0},{"$f":"'2_Upravený'!E218-'1_Původní'!E218","v":0},{"$f":"'2_Upravený'!F218-'1_Původní'!F218","v":0},{"$f":"'2_Upravený'!G218-'1_Původní'!G218","v":0},{"$f":"'2_Upravený'!H218-'1_Původní'!H218","v":0},{"$f":"'2_Upravený'!I218-'1_Původní'!I218","v":442000},{"$f":"'2_Upravený'!J218-'1_Původní'!J218","v":0},{"$f":"'2_Upravený'!K218-'1_Původní'!K218","v":-349800.4143},{"$f":"'2_Upravený'!L218-'1_Původní'!L218","v":0},{"$f":"'2_Upravený'!M218-'1_Původní'!M218","v":0},{"$f":"'2_Upravený'!N218-'1_Původní'!N218","v":0},{"$f":"'2_Upravený'!O218-'1_Původní'!O218","v":254.4521},92454.037799999991]
[null,{"$f":"IF('2_Upravený'!B219=\"\",\"\",'2_Upravený'!B219)","v":"8562"},{"$f":"IF('2_Upravený'!C219=\"\",\"\",'2_Upravený'!C219)","v":"Mgr. Taťána Štosová, Ph.D. - MIKRO"},{"$f":"'2_Upravený'!D219-'1_Původní'!D219","v":0},{"$f":"'2_Upravený'!E219-'1_Původní'!E219","v":0},{"$f":"'2_Upravený'!F219-'1_Původní'!F219","v":0},{"$f":"'2_Upravený'!G219-'1_Původní'!G219","v":0},{"$f":"'2_Upravený'!H219-'1_Původní'!H219","v":0},{"$f":"'2_Upravený'!I219-'1_Původní'!I219","v":154000},{"$f":"'2_Upravený'!J219-'1_Původní'!J219","v":0},{"$f":"'2_Upravený'!K219-'1_Původní'!K219","v":-121876.16250000001},{"$f":"'2_Upravený'!L219-'1_Původní'!L219","v":0},{"$f":"'2_Upravený'!M219-'1_Původní'!M219","v":0},{"$f":"'2_Upravený'!N219-'1_Původní'!N219","v":0},{"$f":"'2_Upravený'!O219-'1_Původní'!O219","v":346.8485},32470.685999999994]
[null,{"$f":"IF('2_Upravený'!B220=\"\",\"\",'2_Upravený'!B220)","v":"8563"},{"$f":"IF('2_Upravený'!C220=\"\",\"\",'2_Upravený'!C220)","v":"Doc. MUDr. Jan Minařík, Ph.D. - HOK"},{"$f":"'2_Upravený'!D220-'1_Původní'!D220","v":0},{"$f":"'2_Upravený'!E220-'1_Původní'!E220","v":0},{"$f":"'2_Upravený'!F220-'1_Původní'!F220","v":0},{"$f":"'2_Upravený'!G220-'1_Původní'!G220","v":0},{"$f":"'2_Upravený'!H220-'1_Původní'!H220","v":0},{"$f":"'2_Upravený'!I220-'1_Původní'!I220","v":297000},{"$f":"'2_Upravený'!J220-'1_Původní'!J220","v":0},{"$f":"'2_Upravený'!K220-'1_Původní'!K220","v":-235046.8848},{"$f":"'2_Upravený'!L220-'1_Původní'!L220","v":0},{"$f":"'2_Upravený'!M220-'1_Původní'!M220","v":0},{"$f":"'2_Upravený'!N220-'1_Původní'!N220","v":0},{"$f":"'2_Upravený'!O220-'1_Původní'!O220","v":580.84280000000001},62533.957999999999]
[null,{"$f":"IF('2_Upravený'!B221=\"\",\"\",'2_Upravený'!B221)","v":"8564"},{"$f":"IF('2_Upravený'!C221=\"\",\"\",'2_Upravený'!C221)","v":"MUDr. Jan Přeček, Ph.D. - I.IK"},{"$f":"'2_Upravený'!D221-'1_Původní'!D221","v":0},{"$f":"'2_Upravený'!E221-'1_Původní'!E221","v":0},{"$f":"'2_Upravený'!F221-'1_Původní'!F221","v":0},{"$f":"'2_Upravený'!G221-'1_Původní'!G221","v":-243752.32490000001},{"$f":"'2_Upravený'!H221-'1_Původní'!H221","v":0},{"$f":"'2_Upravený'!I221-'1_Původní'!I221","v":308000},{"$f":"'2_Upravený'!J221-'1_Původní'!J221","v":0},{"$f":"'2_Upravený'!K221-'1_Původní'!K221","v":0},{"$f":"'2_Upravený'!L221-'1_Původní'!L221","v":0},{"$f":"'2_Upravený'!M221-'1_Původní'!M221","v":0},{"$f":"'2_Upravený'!N221-'1_Původní'!N221","v":0},{"$f":"'2_Upravený'!O221-'1_Původní'!O221","v":15470.4377},79718.112799999988]
[null,{"$f":"IF('2_Upravený'!B222=\"\",\"\",'2_Upravený'!B222)","v":"8565"},{"$f":"IF('2_Upravený'!C222=\"\",\"\",'2_Upravený'!C222)","v":"Prof. MUDr. Ing. Petr Hluštík, Ph.D. - NEUROL"},{"$f":"'2_Upravený'!D222-'1_Původní'!D222","v":0},{"$f":"'2_Upravený'!E222-'1_Původní'!E222","v":0},{"$f":"'2_Upravený'!F222-'1_Původní'!F222","v":0},{"$f":"'2_Upravený'!G222-'1_Původní'!G222","v":0},{"$f":"'2_Upravený'!H222-'1_Původní'!H222","v":112016.23869999999},{"$f":"'2_Upravený'!I222-'1_Původní'!I222","v":0},{"$f":"'2_Upravený'!J222-'1_Původní'!J222","v":0},{"$f":"'2_Upravený'!K222-'1_Původní'!K222","v":0},{"$f":"'2_Upravený'!L222-'1_Původní'!L222","v":0},{"$f":"'2_Upravený'!M222-'1_Původní'!M222","v":0},{"$f":"'2_Upravený'!N222-'1_Původní'!N222","v":0},{"$f":"'2_Upravený'!O222-'1_Původní'!O222","v":413.52420000000001},112429.76289999999]
[null,{"$f":"IF('2_Upravený'!B223=\"\",\"\",'2_Upravený'!B223)","v":"8566"},{"$f":"IF('2_Upravený'!C223=\"\",\"\",'2_Upravený'!C223)","v":"MUDr. Michaela Kaiserová - NEUROL"},{"$f":"'2_Upravený'!D223-'1_Původní'!D223","v":0},{"$f":"'2_Upravený'!E223-'1_Původní'!E223","v":0},{"$f":"'2_Upravený'!F223-'1_Původní'!F223","v":0},{"$f":"'2_Upravený'!G223-'1_Původní'!G223","v":0},{"$f":"'2_Upravený'!H223-'1_Původní'!H223","v":105758.34820000001},{"$f":"'2_Upravený'!I223-'1_Původní'!I223","v":0},{"$f":"'2_Upravený'!J223-'1_Původní'!J223","v":0},{"$f":"'2_Upravený'!K223-'1_Původní'!K223","v":0},{"$f":"'2_Upravený'!L223-'1_Původní'!L223","v":0},{"$f":"'2_Upravený'!M223-'1_Původní'!M223","v":0},{"$f":"'2_Upravený'!N223-'1_Původní'!N223","v":0},{"$f":"'2_Upravený'!O223-'1_Původní'!O223","v":69.105400000000003},105827.45360000001]
[null,{"$f":"IF('2_Upravený'!B224=\"\",\"\",'2_Upravený'!B224)","v":"8567"},{"$f":"IF('2_Upravený'!C224=\"\",\"\",'2_Upravený'!C224)","v":"MUDr. Jana Petřková, Ph.D. - I.IK"},{"$f":"'2_Upravený'!D224-'1_Původní'!D224","v":0},{"$f":"'2_Upravený'!E224-'1_Původní'!E224","v":0},{"$f":"'2_Upravený'!F224-'1_Původní'!F224","v":0},{"$f":"'2_Upravený'!G224-'1_Původní'!G224","v":0},{"$f":"'2_Upravený'!H224-'1_Původní'!H224","v":190000},{"$f":"'2_Upravený'!I224-'1_Původní'!I224","v":-269077.24180000002},{"$f":"'2_Upravený'!J224-'1_Původní'!J224","v":0},{"$f":"'2_Upravený'!K224-'1_Původní'!K224","v":0},{"$f":"'2_Upravený'!L224-'1_Původní'!L224","v":0},{"$f":"'2_Upravený'!M224-'1_Původní'!M224","v":0},{"$f":"'2_Upravený'!N224-'1_Původní'!N224","v":0},{"$f":"'2_Upravený'!O224-'1_Původní'!O224","v":5029.4255999999996},-74047.816200000016]
[null,{"$f":"IF('2_Upravený'!B225=\"\",\"\",'2_Upravený'!B225)","v":"8568"},{"$f":"IF('2_Upravený'!C225=\"\",\"\",'2_Upravený'!C225)","v":"Prof. MUDr. Dagmar Pospíšilová, Ph.D. - DK"},{"$f":"'2_Upravený'!D225-'1_Původní'!D225","v":0},{"$f":"'2_Upravený'!E225-'1_Původní'!E225","v":0},{"$f":"'2_Upravený'!F225-'1_Původní'!F225","v":0},{"$f":"'2_Upravený'!G225-'1_Původní'!G225","v":0},{"$f":"'2_Upravený'!H225-'1_Původní'!H225","v":0},{"$f":"'2_Upravený'!I225-'1_Původní'!I225","v":39633.306000000011},{"$f":"'2_Upravený'!J225-'1_Původní'!J225","v":0},{"$f":"'2_Upravený'!K225-'1_Původní'!K225","v":0},{"$f":"'2_Upravený'!L225-'1_Původní'!L225","v":0},{"$f":"'2_Upravený'!M225-'1_Původní'!M225","v":0},{"$f":"'2_Upravený'!N225-'1_Původní'!N225","v":0},{"$f":"'2_Upravený'!O225-'1_Původní'!O225","v":937.68669999999997},40570.99270000001]
[null,{"$f":"IF('2_Upravený'!B226=\"\",\"\",'2_Upravený'!B226)","v":"8569"},{"$f":"IF('2_Upravený'!C226=\"\",\"\",'2_Upravený'!C226)","v":"MUDr. Přemysl Falt, Ph.D. - II.IK"},{"$f":"'2_Upravený'!D226-'1_Původní'!D226","v":0},{"$f":"'2_Upravený'!E226-'1_Původní'!E226","v":0},{"$f":"'2_Upravený'!F226-'1_Původní'!F226","v":0},{"$f":"'2_Upravený'!G226-'1_Původní'!G226","v":0},{"$f":"'2_Upravený'!H226-'1_Původní'!H226","v":-254831.9761},{"$f":"'2_Upravený'!I226-'1_Původní'!I226","v":322000},{"$f":"'2_Upravený'!J226-'1_Původní'!J226","v":0},{"$f":"'2_Upravený'!K226-'1_Původní'!K226","v":0},{"$f":"'2_Upravený'!L226-'1_Původní'!L226","v":0},{"$f":"'2_Upravený'!M226-'1_Původní'!M226","v":0},{"$f":"'2_Upravený'!N226-'1_Původní'!N226","v":0},{"$f":"'2_Upravený'!O226-'1_Původní'!O226","v":0},67168.0239]
[null,{"$f":"IF('2_Upravený'!B227=\"\",\"\",'2_Upravený'!B227)","v":"8570"},{"$f":"IF('2_Upravený'!C227=\"\",\"\",'2_Upravený'!C227)","v":"Prof. MUDr. Bohuslav Melichar, Ph.D. - ONKO"},{"$f":"'2_Upravený'!D227-'1_Původní'!D227","v":-29850.614099999999},{"$f":"'2_Upravený'!E227-'1_Původní'!E227","v":0},{"$f":"'2_Upravený'!F227-'1_Původní'!F227","v":0},{"$f":"'2_Upravený'!G227-'1_Původní'!G227","v":0},{"$f":"'2_Upravený'!H227-'1_Původní'!H227","v":0},{"$f":"'2_Upravený'!I227-'1_Původní'!I227","v":0},{"$f":"'2_Upravený'!J227-'1_Původní'!J227","v":-202599.33499999999},{"$f":"'2_Upravený'!K227-'1_Původní'!K227","v":0},{"$f":"'2_Upravený'!L227-'1_Původní'!L227","v":0},{"$f":"'2_Upravený'!M227-'1_Původní'!M227","v":0},{"$f":"'2_Upravený'!N227-'1_Původní'!N227","v":0},{"$f":"'2_Upravený'!O227-'1_Původní'!O227","v":24319.960899999998},-208129.98819999999]
[null,{"$f":"IF('2_Upravený'!B228=\"\",\"\",'2_Upravený'!B228)","v":"8571"},{"$f":"IF('2_Upravený'!C228=\"\",\"\",'2_Upravený'!C228)","v":"MUDr. Tomáš Skála, Ph.D., FESC - I.IK"},{"$f":"'2_Upravený'!D228-'1_Původní'!D228","v":0},{"$f":"'2_Upravený'!E228-'1_Původní'!E228","v":0},{"$f":"'2_Upravený'!F228-'1_Původní'!F228","v":0},{"$f":"'2_Upravený'!G228-'1_Původní'!G228","v":-226341.44459999999},{"$f":"'2_Upravený'!H228-'1_Původní'!H228","v":286000},{"$f":"'2_Upravený'!I228-'1_Původní'!I228","v":0},{"$f":"'2_Upravený'!J228-'1_Původní'!J228","v":0},{"$f":"'2_Upravený'!K228-'1_Původní'!K228","v":0},{"$f":"'2_Upravený'!L228-'1_Původní'!L228","v":0},{"$f":"'2_Upravený'!M228-'1_Původní'!M228","v":0},{"$f":"'2_Upravený'!N228-'1_Původní'!N228","v":0},{"$f":"'2_Upravený'!O228-'1_Původní'!O228","v":1683.6321},61342.187500000015]
[null,{"$f":"IF('2_Upravený'!B229=\"\",\"\",'2_Upravený'!B229)","v":"8572"},{"$f":"IF('2_Upravený'!C229=\"\",\"\",'2_Upravený'!C229)","v":"Grant: Doc. MUDr. Petr Šantavý, Ph.D. - KARDIOCHIR"},{"$f":"'2_Upravený'!D229-'1_Původní'!D229","v":0},{"$f":"'2_Upravený'!E229-'1_Původní'!E229","v":0},{"$f":"'2_Upravený'!F229-'1_Původní'!F229","v":0},{"$f":"'2_Upravený'!G229-'1_Původní'!G229","v":0},{"$f":"'2_Upravený'!H229-'1_Původní'!H229","v":267000},{"$f":"'2_Upravený'!I229-'1_Původní'!I229","v":-140869.85010000001},{"$f":"'2_Upravený'!J229-'1_Původní'!J229","v":0},{"$f":"'2_Upravený'!K229-'1_Původní'!K229","v":0},{"$f":"'2_Upravený'!L229-'1_Původní'!L229","v":0},{"$f":"'2_Upravený'!M229-'1_Původní'!M229","v":0},{"$f":"'2_Upravený'!N229-'1_Původní'!N229","v":0},{"$f":"'2_Upravený'!O229-'1_Původní'!O229","v":2759.8856999999998},128890.03559999999]
[null,{"$f":"IF('2_Upravený'!B230=\"\",\"\",'2_Upravený'!B230)","v":"8573"},{"$f":"IF('2_Upravený'!C230=\"\",\"\",'2_Upravený'!C230)","v":"Grant: MUDr. Jan Přeček, PhD. - I.IK"},{"$f":"'2_Upravený'!D230-'1_Původní'!D230","v":0},{"$f":"'2_Upravený'!E230-'1_Původní'!E230","v":0},{"$f":"'2_Upravený'!F230-'1_Původní'!F230","v":0},{"$f":"'2_Upravený'!G230-'1_Původní'!G230","v":0},{"$f":"'2_Upravený'!H230-'1_Původní'!H230","v":213000},{"$f":"'2_Upravený'!I230-'1_Původní'!I230","v":0},{"$f":"'2_Upravený'!J230-'1_Původní'!J230","v":-112379.3186},{"$f":"'2_Upravený'!K230-'1_Původní'!K230","v":0},{"$f":"'2_Upravený'!L230-'1_Původní'!L230","v":0},{"$f":"'2_Upravený'!M230-'1_Původní'!M230","v":0},{"$f":"'2_Upravený'!N230-'1_Původní'!N230","v":0},{"$f":"'2_Upravený'!O230-'1_Původní'!O230","v":246.26900000000001},100866.9504]
[null,{"$f":"IF('2_Upravený'!B231=\"\",\"\",'2_Upravený'!B231)","v":"8574"},{"$f":"IF('2_Upravený'!C231=\"\",\"\",'2_Upravený'!C231)","v":"Grant: Doc. MUDr. Kateřina Menšíková, PhD. - NEURO"},{"$f":"'2_Upravený'!D231-'1_Původní'!D231","v":0},{"$f":"'2_Upravený'!E231-'1_Původní'!E231","v":0},{"$f":"'2_Upravený'!F231-'1_Původní'!F231","v":0},{"$f":"'2_Upravený'!G231-'1_Původní'!G231","v":0},{"$f":"'2_Upravený'!H231-'1_Původní'!H231","v":691000},{"$f":"'2_Upravený'!I231-'1_Původní'!I231","v":-364045.6801},{"$f":"'2_Upravený'!J231-'1_Původní'!J231","v":0},{"$f":"'2_Upravený'!K231-'1_Původní'!K231","v":0},{"$f":"'2_Upravený'!L231-'1_Původní'!L231","v":0},{"$f":"'2_Upravený'!M231-'1_Původní'!M231","v":0},{"$f":"'2_Upravený'!N231-'1_Původní'!N231","v":0},{"$f":"'2_Upravený'!O231-'1_Původní'!O231","v":636.51800000000003},327590.83789999998]
[null,{"$f":"IF('2_Upravený'!B232=\"\",\"\",'2_Upravený'!B232)","v":"8575"},{"$f":"IF('2_Upravený'!C232=\"\",\"\",'2_Upravený'!C232)","v":"Grant: Doc. MUDr. Miroslav Vaverka, CSc. - NEUROCH"},{"$f":"'2_Upravený'!D232-'1_Původní'!D232","v":0},{"$f":"'2_Upravený'!E232-'1_Původní'!E232","v":0},{"$f":"'2_Upravený'!F232-'1_Původní'!F232","v":0},{"$f":"'2_Upravený'!G232-'1_Původní'!G232","v":0},{"$f":"'2_Upravený'!H232-'1_Původní'!H232","v":0},{"$f":"'2_Upravený'!I232-'1_Původní'!I232","v":286000},{"$f":"'2_Upravený'!J232-'1_Původní'!J232","v":0},{"$f":"'2_Upravený'!K232-'1_Původní'!K232","v":-150366.69399999999},{"$f":"'2_Upravený'!L232-'1_Původní'!L232","v":0},{"$f":"'2_Upravený'!M232-'1_Původní'!M232","v":0},{"$f":"'2_Upravený'!N232-'1_Původní'!N232","v":0},{"$f":"'2_Upravený'!O232-'1_Původní'!O232","v":6813.5185000000001},142446.82450000002]
[null,{"$f":"IF('2_Upravený'!B233=\"\",\"\",'2_Upravený'!B233)","v":"8576"},{"$f":"IF('2_Upravený'!C233=\"\",\"\",'2_Upravený'!C233)","v":"Grant: MUDr. Vladislav Raclavský, PhD. - MIKRO"},{"$f":"'2_Upravený'!D233-'1_Původní'!D233","v":0},{"$f":"'2_Upravený'!E233-'1_Původní'!E233","v":0},{"$f":"'2_Upravený'!F233-'1_Původní'!F233","v":0},{"$f":"'2_Upravený'!G233-'1_Původní'!G233","v":0},{"$f":"'2_Upravený'!H233-'1_Původní'!H233","v":0},{"$f":"'2_Upravený'!I233-'1_Původní'!I233","v":775000},{"$f":"'2_Upravený'!J233-'1_Původní'!J233","v":0},{"$f":"'2_Upravený'!K233-'1_Původní'!K233","v":-407572.88099999999},{"$f":"'2_Upravený'!L233-'1_Původní'!L233","v":0},{"$f":"'2_Upravený'!M233-'1_Původní'!M233","v":0},{"$f":"'2_Upravený'!N233-'1_Původní'!N233","v":0},{"$f":"'2_Upravený'!O233-'1_Původní'!O233","v":1172.4091000000001},368599.5281]
[null,{"$f":"IF('2_Upravený'!B234=\"\",\"\",'2_Upravený'!B234)","v":"8577"},{"$f":"IF('2_Upravený'!C234=\"\",\"\",'2_Upravený'!C234)","v":"Grant: Prof. MUDr. Bohuslav Melichar, Ph.D. - ONKO"},{"$f":"'2_Upravený'!D234-'1_Původní'!D234","v":0},{"$f":"'2_Upravený'!E234-'1_Původní'!E234","v":0},{"$f":"'2_Upravený'!F234-'1_Původní'!F234","v":0},{"$f":"'2_Upravený'!G234-'1_Původní'!G234","v":0},{"$f":"'2_Upravený'!H234-'1_Původní'!H234","v":0},{"$f":"'2_Upravený'!I234-'1_Původní'!I234","v":456000},{"$f":"'2_Upravený'!J234-'1_Původní'!J234","v":0},{"$f":"'2_Upravený'!K234-'1_Původní'!K234","v":-239795.30669999999},{"$f":"'2_Upravený'!L234-'1_Původní'!L234","v":0},{"$f":"'2_Upravený'!M234-'1_Původní'!M234","v":0},{"$f":"'2_Upravený'!N234-'1_Původní'!N234","v":0},{"$f":"'2_Upravený'!O234-'1_Původní'!O234","v":819.41139999999996},217024.10470000003]
[null,{"$f":"IF('2_Upravený'!B235=\"\",\"\",'2_Upravený'!B235)","v":"8578"},{"$f":"IF('2_Upravený'!C235=\"\",\"\",'2_Upravený'!C235)","v":"Grant: Prof. MUDr. Mgr. Milan Raška, PhD. - IMUNO"},{"$f":"'2_Upravený'!D235-'1_Původní'!D235","v":0},{"$f":"'2_Upravený'!E235-'1_Původní'!E235","v":0},{"$f":"'2_Upravený'!F235-'1_Původní'!F235","v":0},{"$f":"'2_Upravený'!G235-'1_Původní'!G235","v":0},{"$f":"'2_Upravený'!H235-'1_Původní'!H235","v":465000},{"$f":"'2_Upravený'!I235-'1_Původní'!I235","v":0},{"$f":"'2_Upravený'!J235-'1_Původní'!J235","v":0},{"$f":"'2_Upravený'!K235-'1_Původní'!K235","v":-244543.7286},{"$f":"'2_Upravený'!L235-'1_Původní'!L235","v":0},{"$f":"'2_Upravený'!M235-'1_Původní'!M235","v":0},{"$f":"'2_Upravený'!N235-'1_Původní'!N235","v":0},{"$f":"'2_Upravený'!O235-'1_Původní'!O235","v":2254.4715999999999},222710.74299999999]
[null,{"$f":"IF('2_Upravený'!B236=\"\",\"\",'2_Upravený'!B236)","v":"8579"},{"$f":"IF('2_Upravený'!C236=\"\",\"\",'2_Upravený'!C236)","v":"Grant: Prof. MUDr. Dagmar Pospíšilová, PhD. - DK"},{"$f":"'2_Upravený'!D236-'1_Původní'!D236","v":0},{"$f":"'2_Upravený'!E236-'1_Původní'!E236","v":0},{"$f":"'2_Upravený'!F236-'1_Původní'!F236","v":0},{"$f":"'2_Upravený'!G236-'1_Původní'!G236","v":0},{"$f":"'2_Upravený'!H236-'1_Původní'!H236","v":359000},{"$f":"'2_Upravený'!I236-'1_Původní'!I236","v":0},{"$f":"'2_Upravený'!J236-'1_Původní'!J236","v":0},{"$f":"'2_Upravený'!K236-'1_Původní'!K236","v":-189145.47289999999},{"$f":"'2_Upravený'!L236-'1_Původní'!L236","v":0},{"$f":"'2_Upravený'!M236-'1_Původní'!M236","v":0},{"$f":"'2_Upravený'!N236-'1_Původní'!N236","v":0},{"$f":"'2_Upravený'!O236-'1_Původní'!O236","v":1107.5852},170962.11230000001]
[null,{"$f":"IF('2_Upravený'!B237=\"\",\"\",'2_Upravený'!B237)","v":"8580"},{"$f":"IF('2_Upravený'!C237=\"\",\"\",'2_Upravený'!C237)","v":"Grant: Doc. MUDr. Martin Doležel, PhD. - ONKOL"},{"$f":"'2_Upravený'!D237-'1_Původní'!D237","v":0},{"$f":"'2_Upravený'!E237-'1_Původní'!E237","v":0},{"$f":"'2_Upravený'!F237-'1_Původní'!F237","v":0},{"$f":"'2_Upravený'!G237-'1_Původní'!G237","v":432000},{"$f":"'2_Upravený'!H237-'1_Původní'!H237","v":0},{"$f":"'2_Upravený'!I237-'1_Původní'!I237","v":0},{"$f":"'2_Upravený'!J237-'1_Původní'!J237","v":0},{"$f":"'2_Upravený'!K237-'1_Původní'!K237","v":0},{"$f":"'2_Upravený'!L237-'1_Původní'!L237","v":0},{"$f":"'2_Upravený'!M237-'1_Původní'!M237","v":0},{"$f":"'2_Upravený'!N237-'1_Původní'!N237","v":0},{"$f":"'2_Upravený'!O237-'1_Původní'!O237","v":0},432000]
[null,{"$f":"IF('2_Upravený'!B238=\"\",\"\",'2_Upravený'!B238)","v":"8581"},{"$f":"IF('2_Upravený'!C238=\"\",\"\",'2_Upravený'!C238)","v":"Grant: Doc. MUDr. Ondřej Urban, PhD. - II. IK"},{"$f":"'2_Upravený'!D238-'1_Původní'!D238","v":0},{"$f":"'2_Upravený'!E238-'1_Původní'!E238","v":0},{"$f":"'2_Upravený'!F238-'1_Původní'!F238","v":0},{"$f":"'2_Upravený'!G238-'1_Původní'!G238","v":388000},{"$f":"'2_Upravený'!H238-'1_Původní'!H238","v":0},{"$f":"'2_Upravený'!I238-'1_Původní'!I238","v":0},{"$f":"'2_Upravený'!J238-'1_Původní'!J238","v":0},{"$f":"'2_Upravený'!K238-'1_Původní'!K238","v":0},{"$f":"'2_Upravený'!L238-'1_Původní'!L238","v":0},{"$f":"'2_Upravený'!M238-'1_Původní'!M238","v":0},{"$f":"'2_Upravený'!N238-'1_Původní'!N238","v":0},{"$f":"'2_Upravený'!O238-'1_Původní'!O238","v":0},388000]
[null,{"$f":"IF('2_Upravený'!B239=\"\",\"\",'2_Upravený'!B239)","v":"8582"},{"$f":"IF('2_Upravený'!C239=\"\",\"\",'2_Upravený'!C239)","v":"Grant: MUDr. Tomáš Skála, PhD. FESC - I. IK"},{"$f":"'2_Upravený'!D239-'1_Původní'!D239","v":0},{"$f":"'2_Upravený'!E239-'1_Původní'!E239","v":0},{"$f":"'2_Upravený'!F239-'1_Původní'!F239","v":0},{"$f":"'2_Upravený'!G239-'1_Původní'!G239","v":341000},{"$f":"'2_Upravený'!H239-'1_Původní'!H239","v":0},{"$f":"'2_Upravený'!I239-'1_Původní'!I239","v":0},{"$f":"'2_Upravený'!J239-'1_Původní'!J239","v":0},{"$f":"'2_Upravený'!K239-'1_Původní'!K239","v":0},{"$f":"'2_Upravený'!L239-'1_Původní'!L239","v":0},{"$f":"'2_Upravený'!M239-'1_Původní'!M239","v":0},{"$f":"'2_Upravený'!N239-'1_Původní'!N239","v":0},{"$f":"'2_Upravený'!O239-'1_Původní'!O239","v":0},341000]
[null,{"$f":"IF('2_Upravený'!B240=\"\",\"\",'2_Upravený'!B240)","v":""},{"$f":"IF('2_Upravený'!C240=\"\",\"\",'2_Upravený'!C240)","v":""},{"$f":"'2_Upravený'!D240-'1_Původní'!D240","v":0},{"$f":"'2_Upravený'!E240-'1_Původní'!E240","v":0},{"$f":"'2_Upravený'!F240-'1_Původní'!F240","v":0},{"$f":"'2_Upravený'!G240-'1_Původní'!G240","v":0},{"$f":"'2_Upravený'!H240-'1_Původní'!H240","v":0},{"$f":"'2_Upravený'!I240-'1_Původní'!I240","v":0},{"$f":"'2_Upravený'!J240-'1_Původní'!J240","v":0},{"$f":"'2_Upravený'!K240-'1_Původní'!K240","v":0},{"$f":"'2_Upravený'!L240-'1_Původní'!L240","v":0},{"$f":"'2_Upravený'!M240-'1_Původní'!M240","v":0},{"$f":"'2_Upravený'!N240-'1_Původní'!N240","v":0},{"$f":"'2_Upravený'!O240-'1_Původní'!O240","v":0},0]
[]
[67102004,"Transfery jiného poskytovatele - ostatní",null,{"$f":"SUM(D247:D247)","v":0},0,0,0,0,0,0,0,0,0,0,0,0]
[null,{"$f":"IF('2_Upravený'!B243=\"\",\"\",'2_Upravený'!B243)","v":"5106"},{"$f":"IF('2_Upravený'!C243=\"\",\"\",'2_Upravený'!C243)","v":"NTMC: SHAPES"},{"$f":"'2_Upravený'!D243-'1_Původní'!D243","v":0},{"$f":"'2_Upravený'!E243-'1_Původní'!E243","v":0},{"$f":"'2_Upravený'!F243-'1_Původní'!F243","v":0},{"$f":"'2_Upravený'!G243-'1_Původní'!G243","v":0},{"$f":"'2_Upravený'!H243-'1_Původní'!H243","v":0},{"$f":"'2_Upravený'!I243-'1_Původní'!I243","v":0},{"$f":"'2_Upravený'!J243-'1_Původní'!J243","v":0},{"$f":"'2_Upravený'!K243-'1_Původní'!K243","v":0},{"$f":"'2_Upravený'!L243-'1_Původní'!L243","v":0},{"$f":"'2_Upravený'!M243-'1_Původní'!M243","v":0},{"$f":"'2_Upravený'!N243-'1_Původní'!N243","v":0},{"$f":"'2_Upravený'!O243-'1_Původní'!O243","v":0},{"$f":"SUM(D243:O243)","v":0}]
[null,{"$f":"IF('2_Upravený'!B244=\"\",\"\",'2_Upravený'!B244)","v":"5107"},{"$f":"IF('2_Upravený'!C244=\"\",\"\",'2_Upravený'!C244)","v":"NTMC: PROFID"},{"$f":"'2_Upravený'!D244-'1_Původní'!D244","v":0},{"$f":"'2_Upravený'!E244-'1_Původní'!E244","v":0},{"$f":"'2_Upravený'!F244-'1_Původní'!F244","v":0},{"$f":"'2_Upravený'!G244-'1_Původní'!G244","v":0},{"$f":"'2_Upravený'!H244-'1_Původní'!H244","v":0},{"$f":"'2_Upravený'!I244-'1_Původní'!I244","v":0},{"$f":"'2_Upravený'!J244-'1_Původní'!J244","v":0},{"$f":"'2_Upravený'!K244-'1_Původní'!K244","v":0},{"$f":"'2_Upravený'!L244-'1_Původní'!L244","v":0},{"$f":"'2_Upravený'!M244-'1_Původní'!M244","v":0},{"$f":"'2_Upravený'!N244-'1_Původní'!N244","v":0},{"$f":"'2_Upravený'!O244-'1_Původní'!O244","v":0},{"$f":"SUM(D244:O244)","v":0}]
[null,{"$f":"IF('2_Upravený'!B245=\"\",\"\",'2_Upravený'!B245)","v":"5108"},{"$f":"IF('2_Upravený'!C245=\"\",\"\",'2_Upravený'!C245)","v":"NTMC: Projekt niCE-life"},{"$f":"'2_Upravený'!D245-'1_Původní'!D245","v":0},{"$f":"'2_Upravený'!E245-'1_Původní'!E245","v":0},{"$f":"'2_Upravený'!F245-'1_Původní'!F245","v":0},{"$f":"'2_Upravený'!G245-'1_Původní'!G245","v":0},{"$f":"'2_Upravený'!H245-'1_Původní'!H245","v":0},{"$f":"'2_Upravený'!I245-'1_Původní'!I245","v":0},{"$f":"'2_Upravený'!J245-'1_Původní'!J245","v":0},{"$f":"'2_Upravený'!K245-'1_Původní'!K245","v":0},{"$f":"'2_Upravený'!L245-'1_Původní'!L245","v":0},{"$f":"'2_Upravený'!M245-'1_Původní'!M245","v":0},{"$f":"'2_Upravený'!N245-'1_Původní'!N245","v":0},{"$f":"'2_Upravený'!O245-'1_Původní'!O245","v":0},0]
[null,{"$f":"IF('2_Upravený'!B246=\"\",\"\",'2_Upravený'!B246)","v":"5110"},{"$f":"IF('2_Upravený'!C246=\"\",\"\",'2_Upravený'!C246)","v":"NTMC: Projekt X"},{"$f":"'2_Upravený'!D246-'1_Původní'!D246","v":0},{"$f":"'2_Upravený'!E246-'1_Původní'!E246","v":0},{"$f":"'2_Upravený'!F246-'1_Původní'!F246","v":0},{"$f":"'2_Upravený'!G246-'1_Původní'!G246","v":0},{"$f":"'2_Upravený'!H246-'1_Původní'!H246","v":0},{"$f":"'2_Upravený'!I246-'1_Původní'!I246","v":0},{"$f":"'2_Upravený'!J246-'1_Původní'!J246","v":0},{"$f":"'2_Upravený'!K246-'1_Původní'!K246","v":0},{"$f":"'2_Upravený'!L246-'1_Původní'!L246","v":0},{"$f":"'2_Upravený'!M246-'1_Původní'!M246","v":0},{"$f":"'2_Upravený'!N246-'1_Původní'!N246","v":0},{"$f":"'2_Upravený'!O246-'1_Původní'!O246","v":0},0]
[null,{"$f":"IF('2_Upravený'!B247=\"\",\"\",'2_Upravený'!B247)","v":""},{"$f":"IF('2_Upravený'!C247=\"\",\"\",'2_Upravený'!C247)","v":""},{"$f":"'2_Upravený'!D247-'1_Původní'!D247","v":0},{"$f":"'2_Upravený'!E247-'1_Původní'!E247","v":0},{"$f":"'2_Upravený'!F247-'1_Původní'!F247","v":0},{"$f":"'2_Upravený'!G247-'1_Původní'!G247","v":0},{"$f":"'2_Upravený'!H247-'1_Původní'!H247","v":0},{"$f":"'2_Upravený'!I247-'1_Původní'!I247","v":0},{"$f":"'2_Upravený'!J247-'1_Původní'!J247","v":0},{"$f":"'2_Upravený'!K247-'1_Původní'!K247","v":0},{"$f":"'2_Upravený'!L247-'1_Původní'!L247","v":0},{"$f":"'2_Upravený'!M247-'1_Původní'!M247","v":0},{"$f":"'2_Upravený'!N247-'1_Původní'!N247","v":0},{"$f":"'2_Upravený'!O247-'1_Původní'!O247","v":0},0]

{"sheet":"CisNS","index":5,"n_rows":1042,"n_cols":2,"rows_kept":1042,"cut":false,"hidden":true,"merged":[]}
["pracv","pracvt"]
["0101","Vedení klinického pracoviště"]
["0102",""]
["0103",""]
["0104","OP - Interaktivní kardiologie-moderní výukové metody"]
["0107","IOP- Mod.obn.přistr.vyb.komplex.kardiovas.centra"]
["0111","Lůžkové oddělení 1 "]
["0112","Lůžkové oddělení"]
["0113","Lůžkové oddělení 4 "]
["0115","Lůžkové oddělení ECMO"]
["0116","Lůžkové oddělení COVID 19"]
["0117","1IK: lůžkové oddělení"]
["0121","Ambulance"]
["0122","Ambulance - PAH "]
["0123","Ambulance"]
["0124","Ambulance"]
["0131","JIP "]
["0171","Odd. invaz. vyš. metod-kardiovertery"]
["0172","Katetrizační sál"]
["0176","IROP - Návazná péče"]
["0182","Rezidenti 2015 - nelékařské obory"]
["0183","Rezidenti 2016 - ošetřovatelská a intenzivní péče"]
["0184","1IK: rezidenti 2019 - nelékařské obory"]
["0185","Rezidenti 2018 - nelékařské obory"]
["0187","1IK: rezidenti 2013 - ošetřovatelská péče"]
["0188","Rezidenti 2017 - nelékařské obory"]
["0189","Rezidenti 2014 - nelékařské obory"]
["0194","Centrum - I.interna "]
["0201","Vedení klinického pracoviště gastroenterologiie"]
["0204","IOP - Mod.obn.přístr.vyb.centra komplexní onkologické péče "]
["0205","IOP - Mod.obn.přístr.vyb.traumatologického c."]
["0206","IOP - Mod.tech.vyb.v oblasti prevence nozokomiál.infek."]
["0213","Lůžkové oddělení 30C"]
["0216","Metabolická jednotka 30M"]
["0221","Ambulance"]
["0226",""]
["0231","JIP 30D"]
["0266","Pracoviště DK COS"]
["0271","Endoskopie"]
["0272","Dospávací hala "]
["0276","IROP - Návazná péče"]
["0284","2IK-GER: rezidenti 2019 - nelékařské obory"]
["0286","Rezidenti 2018 - lékaři"]
["0294","Centrum - II.interna"]
["0301","Vedení klinického pracoviště"]
["0306","IOP - Mod.tech.vyb.v oblasti prevence nozokomiál.infek."]
["0311","Lůžkové oddělení 39A + 39R"]
["0312","Lůžkové oddělení 39B + 39C"]
["0313","3IK: COVID - ORT"]
["0321","Ambulance"]
["0322","Ambulance - podiatrie"]
["0331","JIP 39D"]
["0352","Hemodialyzační středisko"]
["0353","CAPD"]
["0376","IROP - Návazná péče"]
["0384","Rezidenti 2010 projekt č. 1 (lékaři)"]
["0386","3IK: Rezidenti 2019 - lékaři"]
["0387","3IK: Rezidenti 2020 - lékaři"]
["0394","Centrum - III. interna"]
["0401","Vedení klinického pracoviště"]
["0404","IOP - Mod.obn.přístr.vyb.centra komplexní onkologické péče "]
["0406","IOP - Mod.tech.vyb.v oblasti prevence nozokomiál.infek."]
["0411","Lůžkové oddělení 8"]
["0412","Lůžkové oddělení 9 + 9P"]
["0413","Lůžkové oddělení 3"]
["0414","Lůžkové oddělení 4"]
["0421","Ambulance"]
["0422","Ambulance"]
["0432","JIP  6"]
["0464","Pracoviště COS"]
["0466","Pracoviště DK COS"]
["0471","Odd. invaz. vyš. metotody-endoskopie"]
["0476","IROP - Návazná péče"]
["0483","Rezidenti 2016 - ošetřovatelská a intenzivní péče"]
["0484","1CHIR: rezidenti 2019 - nelékařské obory"]
["0487","1CHIR: rezidenti 2013 - ošetřovatelská péče"]
["0489","Rezidenti 2014 - nelékařské obory"]
["0499","Rezidenti"]
["0501","Vedení klinického pracoviště"]
["0507","IOP- Mod.obn.přistr.vyb.komplex.kardiovas.centra"]
["0511","Lůžkové oddělení 37"]
["0521","Ambulance"]
["0532","JIP 37A "]
["0564","Pracoviště COS"]
["0566","Pracoviště DK COS"]
["0601","Vedení klinického pracoviště"]
["0604","IOP - Mod.obn.přístr.vyb.centra komplexní onkologické péče "]
["0605","IOP - Mod.obn.přístr.vyb.traumatologického c."]
["0606","IOP - Mod.tech.vyb.v oblasti prevence nozokomiál.infek."]
["0609","IOP - Mod.obn.přístr.vyb.cerebrovaskulárního centra FNOL"]
["0611","Lůžkové oddělení 34"]
["0612","Lůžkové oddělení 36A"]
["0621","Ambulance"]
["0631","JIP "]
["0662","Operační sál - lokální"]
["0666","Pracoviště DK COS"]
["0676","IROP - Návazná péče"]
["0682","Rezidenti 2015 - nelékařské obory"]
["0683","Rezidenti 2016 - ošetřovatelská a intenzivní péče"]
["0684","NCHIR: rezidenti 2019 - nelékařské obory"]
["0685","Rezidenti 2018"]
["0687","NCHIR: rezidenti 2013 - ošetřovatelská péče"]
["0688","Rezidenti 2017 - nelékařské obory"]
["0689","Rezidenti 2014 - nelékařské obory"]
["0701","Vedení klinického pracoviště"]
["0705","IOP - Mod.obn.přístr.vyb.traumatologického c."]
["0706","IOP - Mod.tech.vyb.v oblasti prevence nozokomiál.infek."]
["0709","IOP - Mod.obn.přístr.vyb.cerebrovaskulárního centra FNOL"]
["0715","Lůžkové oddělení ECMO"]
["0721","Ambulance"]
["0731","JIP"]
["0732","NIOP"]
["0733","DIOP"]
["0762","Operační sál - lok. prac. anesteziologů"]
["0764","Pracoviště COS"]
["0765","Dospávací hala KAR"]
["0766","Pracoviště DK COS"]
["0775","IOP - Mod.obn.přístr.vyb.traumatologického cen. II"]
["0776","IROP - Návazná péče"]
["0782","Rezidenti 2015 - nelékařské obory"]
["0783","Rezidenti 2016 - ošetřovatelská a intenzivní péče"]
["0785","Rezidenti 2018"]
["0787","KARIM: rezidenti 2013 - ošetřovatelská péče"]
["0788","Rezidenti 2017 - nelékařské obory"]
["0789","Rezidenti 2014 - nelékařské obory"]
["0794","Centrum - KAR"]
["0801","Vedení klinického pracoviště"]
["0802","ZT pro Perinatologické centrum - IISSP"]
["0806","IOP - Mod.tech.vyb.v oblasti prevence nozokomiál.infek."]
["0811","Lůžkové oddělení 19B (šestinedělí)"]
["0817","Lůžkové oddělení 17 (operativní gyn.)"]
["0818","Intermediální jednotka (17A)"]
["0821","Ambulance"]
["0822","Ambulance - fetální medicína"]
["0823","Centrum asistované reprodukce"]
["0831","JIP"]
["0832","JIP 19 (porodní sál)"]
["0841","Laboratoř cytologická"]
["0862","Porodní sál - lokální"]
["0863","Operační sál OP 17 (z 08 62)"]
["0864","Pracoviště COS"]
["0873","IROP - Mod.obn.přístr.vyb.perinatologického centra"]
["0874","IROP - Mod.obn.přístr.vyb.onkogynekologického centra"]
["0884","PORGYN: rezidenti 2019 - nelékařské obory"]
["0885","Rezidenti 2018"]
["0886","Rezidenti 2018"]
["0901","Vedení klinického pracoviště"]
["0902","ZT pro Perinatologické centrum - IISSP"]
["0903","Norský fond - projekt 2009"]
["0904","Norský fond - projekt 2015"]
["0911","Lůžkové oddělení 16C + 16B +16BD"]
["0912",""]
["0921","Ambulance"]
["0931","JIP 16A +16D"]
["0932","JIP"]
["0973","IROP - Mod.obn.přístr.vyb.perinatologického centra"]
["0982","Rezidenti 2015 - nelékařské obory"]
["0984","NOVO: Rezidenti 2019 - nelékařské obory"]
["0988","Rezidenti 2017 - nelékařské obory"]
["0994","Centrum - novorozenecké"]
["1001","Vedení klinického pracoviště"]
["1004","IOP - Mod.obn.přístr.vyb.c.k.onkologické p.  "]
["1006","IOP - Mod.tech.vyb.v oblasti prevence nozokomiál.infek."]
["1008","IOP - Mod.a obnova přístroj.vyb.komplex.rehab.péče"]
["1011","Lůžkové oddělení 28B"]
["1012","Lůžkové oddělení 28C vč.dospávací haly"]
["1013","Lůžkové oddělení 21A"]
["1014","Lůžkové oddělení 21B"]
["1015","Lůžkové oddělení 28D"]
["1021","Ambulance"]
["1022","LPS dětská"]
["1023","Praktický lékař pro děti a dorost"]
["1026",""]
["1031","JIP 21B"]
["1032","JIP"]
["1033","JIP 21C (pro větší děti)"]
["1041","LEM"]
["1042","LEM"]
["1066","Pracoviště DK COS"]
["1071","Endoskopie"]
["1076","IROP - Návazná péče"]
["1083","Rezidenti 2016 - ošetřovatelská a intenzivní péče"]
["1084","DK: rezidenti 2010 projekt č. 1 (lékaři)"]
["1086","DK: Rezidenti 2019 - lékaři"]
["1087","DK: rezidenti 2020 - lékaři"]
["1089","Rezidenti 2014 - nelékařské obory"]
["1094","Centrum - DK"]
["1096","OPVaVI - NPU I (projekt ÚMTM)"]
["1097","OPVaVI - projekt ÚMTM (pouze os.nákl.)"]
["1101","Vedení klinického pracoviště"]
["1102","ZT pro ORT - IISSP"]
["1105","IOP - Mod.obn.přístr.vyb.traumatologického c."]
["1106","IOP - Mod.tech.vyb.v oblasti prevence nozokomiál.infek."]
["1108","IOP - Mod.a obnova přístroj.vyb.komplex.rehab.péče"]
["1111","Lůžkové oddělení 29A"]
["1112","Lůžkové oddělení 29B"]
["1113","Lůžkové oddělení 29C (6 lůžek KÚČOCH)"]
["1121","Ambulance"]
["1131","JIP 29A"]
["1151","Diagnostika poruch pohyb. funkcí - výzkum"]
["1162","Operační sál - lokální"]
["1166","Pracoviště DK COS"]
["1176","IROP - Návazná péče"]
["1183","Rezidenti 2016 - ošetřovatelská a intenzivní péče"]
["1184","ORT: rezidenti 2019 - nelékařské obory"]
["1185","Rezidenti 2018"]
["1188","Rezidenti 2017 - nelékařské obory"]
["1189","Rezidenti 2014 - nelékařské obory"]
["1201","Vedení klinického pracoviště"]
["1202","ISPROFIN -obměna pořístroje Lithotryptor"]
["1211","Lůžkové oddělení "]
["1221","Ambulance "]
["1262","Operační sál - lokální"]
["1264","Pracoviště COS"]
["1266","Pracoviště DK COS"]
["1276","UROL: IROP - Návazná péče"]
["1301","Vedení klinického pracoviště"]
["1306","IOP - Mod.tech.vyb.v oblasti prevence nozokomiál.infek."]
["1311","Lůžkové oddělení 14"]
["1321","Ambulance"]
["1331","JIP"]
["1362","Operační sál - lokální"]
["1364","Pracoviště COS"]
["1366","Pracoviště DK COS"]
["1384","ORL: rezidenti 2019 - nelékařské obory"]
["1385","ORL: rezidenti 2018 - nelékařské obory"]
["1388","Rezidenti 2017 - nelékařské obory"]
["1389","Rezidenti 2014 - nelékařské obory"]
["1401","Vedení klinického pracoviště"]
["1404","Norský fond - projekt 2015"]
["1406","IOP - Mod.tech.vyb.v oblasti prevence nozokomiál.infek."]
["1411","Lůžka"]
["1412","Lůžka 13"]
["1421","Ambulance"]
["1462","Operační sál - lokální"]
["1466","Pracoviště DK COS"]
["1484","OCNI: rezidenti 2019 - nelékařské obory"]
["1494","Centrum - oční"]
["1501","Vedení klinického pracoviště"]
["1521","Ambulance"]
["1584","Rezidenti 2010 projekt č. 1 (lékaři)"]
["1594","Centrum - alergologie"]
["1601","Vedení klinického pracoviště"]
["1604","IOP - Mod.obn.přístr.vyb.centra komplexní onkologické péče "]
["1605","IOP - Mod.obn.přístr.vyb.traumatologického c."]
["1606","IOP - Mod.tech.vyb.v oblasti prevence nozokomiál.infek."]
["1611","Lůžkové oddělení 26"]
["1612","Lůžkové oddělení 25"]
["1613","Lůžkové oddělení 24"]
["1621","Ambulance"]
["1622","Ambulance - transplantace"]
["1631","JIP 24A"]
["1641","Bronchologie"]
["1666","Pracoviště DK COS"]
["1676","IROP - Návazná péče"]
["1684","PLIC: rezidenti 2010 projekt č. 1 (lékaři)"]
["1685","Rezidenti 2018"]
["1686","PLIC: rezidenti 2019 - lékaři"]
["1687","PLIC: rezidenti 2020 - lékaři"]
["1694","Centrum - TRN"]
["1697","OPVaVI - projekt ÚMTM (pouze os.nákl.)"]
["1701","Vedení klinického pracoviště"]
["1702","ReMuS - nadace Impuls"]
["1703","Vzdělávací síť iktových center"]
["1704","OP VVV - Molekulární, buněčný a klinický přístup ke zdravému stárnutí"]
["1706","IOP - Mod.tech.vyb.v oblasti prevence nozokomiál.infek."]
["1709","IOP - Mod.obn.přístr.vyb.cerebrovaskulárního centra FNOL"]
["1711","Lůžkové oddělení 31A  "]
["1712","Lůžkové oddělení 31B"]
["1713","Lůžkové oddělení 35"]
["1721","Ambulance"]
["1731","JIP A  (5 lůžek resuscitační péče)"]
["1732","JIP B"]
["1752",""]
["1753",""]
["1791","Stacionář"]
["1794","Centrum - neurologie"]
["1801","Vedení klinického pracoviště"]
["1806","IOP - Mod.tech.vyb.v oblasti prevence nozokomiál.infek."]
["1811","Lůžkové oddělení 32A"]
["1812","Lůžkové oddělení 32C + krizové centrum"]
["1813","Lůžkové oddělení 32B"]
["1814","Ergoterapie a fyzioterapie"]
["1821","Ambulance"]
["1822","Ambulantní klinická psychologie"]
["1823","Ambulance AT centrum"]
["1824",""]
["1886","Rezidenti 2018"]
["1887","PSY: rezidenti 2020 - lékaři"]
["1891","Stacionář"]
["1901","Vedení klinického pracoviště"]
["1911","Lůžkové oddělení 43"]
["1921","Ambulance"]
["1922","Ambulance - péče o zaměstnance FNO"]
["1923","Ambulance - Centrum očkování"]
["1924","PRAC: ambulance - COVID-19 vakcinační centrum"]
["1925","PRAC: ambulance - COVID-19 mobilní očkovací teamy"]
["2001","Vedení klinického pracoviště"]
["2011","Lůžkové oddělení 10"]
["2021","Ambulance + operační sál lokální"]
["2022","Ambulance -  samoplátci"]
["2062",""]
["2094","Centrum - kožní "]
["2101","Vedení klinického pracoviště"]
["2102","OP - Informační síť onkologických center"]
["2103","Národní onkologický registr - NOR"]
["2104","IOP - Mod.obn.přístr.vyb.centra komplexní onkologické péče "]
["2106","IOP - Mod.tech.vyb.v oblasti prevence nozokomiál.infek."]
["2108","IOP - Mod.obn.přístr.vyb.c.k.onkologické p. II"]
["2111","Lůžkové oddělení 42A"]
["2112","Lůžkové oddělení 42B"]
["2113","Lůžkové oddělení"]
["2121","Ambulance + mamol. poradna"]
["2129","Ambulance"]
["2151","Ozařovny-přístrojové pracoviště"]
["2152","Radiační onkologie - brachyterapie"]
["2176","IROP - Návazná péče"]
["2194","Centrum  - onkologie"]
["2197","OPVaVI - projekt ÚMTM (pouze os.nákl.)"]
["2201","Vedení klinického pracoviště"]
["2208","IOP - Mod.obn.přístr.vyb.c.k.onkologické p. II"]
["2211","Lůžkové oddělení 40"]
["2221","Ambulance"]
["2241","Laboratoř-SVLS"]
["2251","Přístr.pracoviště - PET "]
["2277","IOP - Mod.obn.přístr.vyb.c.k.onkologické p. III"]
["2282","KNM: Rezidenti 2009 projekt č. 1(lékaři)"]
["2294","Centrum - KNM"]
["2401","Vedení klinického pracoviště"]
["2406","IOP - Mod.tech.vyb.v oblasti prevence nozokomiál.infek."]
["2421","Ambulance "]
["2422","Ambulance "]
["2423","Ambulance "]
["2424","Ambulance "]
["2425","Ambulance "]
["2426","Ambulance "]
["2501","Vedení klinického pracoviště"]
["2505","IOP - Mod.obn.přístr.vyb.traumatologického c."]
["2506","IOP - Mod.tech.vyb.v oblasti prevence nozokomiál.infek."]
["2511","Lůžkové oddělení 33"]
["2521","Ambulance"]
["2522","LPS stomatologická"]
["2523","LPS stomatologická - denní"]
["2525",""]
["2526",""]
["2562","Operační sál "]
["2563","Operační sál "]
["2565","Operační sál "]
["2576","IROP - Návazná péče"]
["2601","Vedení klinického pracoviště"]
["2608","IOP Mod.a obnova přístroj.vyb.komplex.rehab.péče"]
["2609","IOP - Mod.obn.přístr.vyb.cerebrovaskulárního centra FNOL"]
["2611","Lůžkové oddělení 44 a 45 "]
["2621",""]
["2622","RHC ambulance + kineziologie,kinezioterapie"]
["2651",""]
["2652",""]
["2701","Vedení klinického pracoviště"]
["2708","IOP Mod.a obnova přístroj.vyb.komplex.rehab.péče"]
["2721","TVL ambulance"]
["2723","Ambulance - akupunktura"]
["2724","Ambulance - prevence"]
["2801","Vedení klinického pracoviště"]
["2821","Ambulance"]
["2841","Laboratoř"]
["2901","Vedení klinického pracoviště"]
["2911","Lůžkové oddělení"]
["2921","Ambulance"]
["2962","Operační sál lokální"]
["2964","Pracoviště COS"]
["2966","Pracoviště DK COS"]
["2994","Centrum -  PCHIR"]
["3001","Vedení klinického pracoviště geriatrie"]
["3011","Lůžkové oddělení 46 "]
["3012","Lůžkové oddělení 48 (LDN)"]
["3021","Ambulance"]
["3022","Ambulance"]
["3081",""]
["3101","Vedení klinického pracoviště"]
["3108","IOP Mod.a obnova přístroj.vyb.komplex.rehab.péče"]
["3111","Lůžkové oddělení 27"]
["3112","Lůžkové oddělení"]
["3121","Ambulance"]
["3131","JIP 27"]
["3164","Pracoviště COS"]
["3166","Pracoviště DK COS"]
["3176","IROP - Návazná péče"]
["3201","Vedení klinického pracoviště"]
["3203","HOK: OPŽP - Novostavba pavilonu HOK"]
["3204","IOP - Mod.obn.přístr.vyb.centra komplexní onkologické péče "]
["3208","IOP - Mod.obn.přístr.vyb.c.k.onkologické p. II"]
["3211","Lůžkové oddělení 5A"]
["3221","Ambulance"]
["3231","JIP 5B"]
["3232","JIP 5C"]
["3241","Laboratoř - SVLS"]
["3242","Tkáňová banka"]
["3243","Laboratoř krevních obrazů a cytomorfologie"]
["3244","Laboratoř koagulační"]
["3245","Laboratoř cytogenetiky a molekulární cytogenetiky"]
["3246","Laboratoř průtokové cytometrie"]
["3247","Laboratoř molekulární biologie"]
["3248","Laboratoř tkáňových kultur"]
["3249","Array CGH"]
["3276","IROP - Návazná péče"]
["3282","Rezidenti 2015 - nelékařské obory"]
["3283","Rezidenti 2016 - ošetřovatelská a intenzivní péče"]
["3284","HOK: rezidenti 2019 - nelékařské obory"]
["3285","Rezidenti 2018"]
["3287","HOK: rezidenti 2013 - ošetřovatelská péče"]
["3289","Rezidenti 2014 - nelékařské obory"]
["3294","Centrum -  HOK"]
["3301","Vedení klinického pracoviště"]
["3302","E-learningová podpora - Biolink"]
["3303","E-learningová podpora prakt. výuky biochem.a imunogen"]
["3321","Metabolická ambulance"]
["3322","Úsek centrálních odběrů"]
["3341","Centrální laboratoř"]
["3342","Laboratoř DMP"]
["3343","Centrální laboratorní příjem"]
["3344",""]
["3345","OKB: Laboratoř kardioimunogenetiky"]
["3386","OKB: rezidenti 2011 projekt č.2 (oš.péče)"]
["3396","OPVaVI - NPU I (projekt ÚMTM)"]
["3397","OPVaVI - projekt ÚMTM (pouze os.nákl.)"]
["3401","Vedení klinického pracoviště"]
["3405","IOP - Mod.obn.přístr.vyb.traumatologického c."]
["3407","IOP- Mod.obn.přistr.vyb.komplex.kardiovas.centra"]
["3408","IOP - Mod.obn.přístr.vyb.c.k.onkologické p. II"]
["3409","IOP - Mod.obn.přístr.vyb.cerebrovaskulárního centra FNOL"]
["3451","Přístr. pracoviště -SVLS + magnet. rezonance"]
["3452","Přístr. pracoviště -detašová pracoviště+screen.m."]
["3464","Pracoviště COS"]
["3471","Intervenční radiol. + katetrizační sál os.nákl."]
["3473","RTG: IROP - Mod.obn.vyb.přístr.perinatologi"]
["3475","IOP - Mod.obn.přístr.vyb.traumatologického cen. II"]
["3476","IROP - Návazná péče"]
["3477","IOP - Mod.obn.přístr.vyb.c.k.onkologické p. III"]
["3484","RTG: rezidenti 2019 - nelékařské obory"]
["3485","Rezidenti 2018"]
["3501","Vedení klinického pracoviště"]
["3503","TO - krizová připravenost"]
["3521","Ambulance - hematologická poradna"]
["3522","Odběrné místo Jesenícká nemocnice"]
["3541","Laboratoř - SVLS"]
["3544","Pochůzková služba"]
["3581",""]
["3587",""]
["3590","Výroba"]
["3621","Ambulance"]
["3704","IOP - Mod.obn.přístr.vyb.centra komplexní onkologické péče "]
["3741","Laboratoř"]
["3742","Laboratoř - referenční diagnostika"]
["3743","Laboratoř"]
["3788","PATOL: rezidenti 2012 projekt č. 1 (lékaři)"]
["3797","OPVaVI - projekt ÚMTM (pouze os.nákl.)"]
["3841","Soudní lékařství - laboratoř"]
["3921","Ambulance - odborná poradna"]
["4041","Mikrobiologie - laboratoř"]
["4081",""]
["4097","OPVaVI - projekt ÚMTM (pouze os.nákl.)"]
["4141","Imunologie - laboratoř"]
["4142",""]
["4143","Imunologie"]
["4181",""]
["4197","OPVaVI - projekt ÚMTM (pouze os.nákl.)"]
["4321","Ambulance - konzilia"]
["4397","OPVaVI - projekt ÚMTM (pouze os.nákl.)"]
["4398","Klinická farmakologie"]
["4441","LEM - laboratoř experimentální medicíny"]
["4442","LEM - referenční diagnostika"]
["4443","LEM - laboratoř kardiogenomiky "]
["4496","OPVaVI - NPU I (projekt ÚMTM)"]
["4581",""]
["4598","Sociální oddělení"]
["4602","RPZP - Umění komunikace-podpora dárcovství orgánů"]
["4692","Transplantační centrum + koordinační"]
["4704","IOP - Mod.obn.přístr.vyb.centra komplexní onkologické péče "]
["4705","IOP - Mod.obn.přístr.vyb.traumatologického c."]
["4764","Centrální operační sály "]
["4766","Operační sály dětské chirurgie"]
["4776","IROP - Návazná péče"]
["4782","Rezidenti 2015 - nelékařské obory"]
["4787","COSS: rezidenti 2013 - ošetřovatelská péče"]
["4789","Rezidenti 2014 - nelékařské obory"]
["4801","Lékárna - vedení klinického pracoviště"]
["4802","Lékárna - výdejna Z (hlavní lékárna)"]
["4803","OP - specializační vzdělávání klinických farmaceutů"]
["4804","Lékárna - výdejna A (monoblok)"]
["4805","Lékárna - PZT-FONI"]
["4806","Lékárna - výdej HVLP"]
["4807","Lékárna - klinický farmaceut"]
["4808","LEK: lékárna - výdejna ZP - Puškinova ul."]
["4809","LEK: výdejna léků - Puškinova ul."]
["4822","Lékárenská pohotovost"]
["4841","Lékárna - oddělení ředění cytostatik"]
["4842","Lékárna - oddělení přípravy sterilních léčiv"]
["4843","Lékárna - oddělení přípravy léčiv"]
["4844","Lékárna - oddělení diagnostik"]
["5001","Vedení klinického pracoviště"]
["5007","IOP- Mod.obn.přistr.vyb.komplex.kardiovas.centra"]
["5011","Lůžkové oddělení 50"]
["5015","Lůžkové oddělení ECMO"]
["5021","Ambulance"]
["5031","JIP 50B"]
["5032","JIP"]
["5062","Operační sál - lokální"]
["5071","PICC tým"]
["5076","IROP - Návazná péče"]
["5082","Rezidenti 2015 - nelékařské obory"]
["5083","Rezidenti 2016 - ošetřovatelská a intenzivní péče"]
["5085","Rezidenti 2018"]
["5087","KCHIR: rezidenti 2013 - ošetřovatelská péče"]
["5089","Rezidenti 2014 - nelékařské obory"]
["5102","NTMC - Národní telemedicínské centrum - provoz"]
["5103","NTMC - Transfer technologií"]
["5104","NTMC - SCIROCCO"]
["5105","NTMC - TWINNING"]
["5106","NTMC: SHAPES"]
["5107","NTMC: PROFID"]
["5108","NTMC: Projekt niCE-life"]
["5110","NTMC: Projekt X"]
["5398","Odd. lékařské fyziky a rad. ochrany"]
["5498","Oddělení nemocniční hygieny"]
["5602","IOP - komplex.technol.vyb.v obl. sterilizace prádla"]
["5606","IOP - Mod.tech.vyb.v oblasti prevence nozokomiál.infek."]
["5674","IROP - Mod.obn.vyb.přístr.onkogynekol.cen."]
["5676","IROP - Návazná péče"]
["5681",""]
["5684",""]
["5693","Oddělení centrální sterilizace"]
["5695","OCS - detašované pracoviště Ortopedie"]
["5696","OCS - detašované pracoviště  DK"]
["5721","Nutriční ambulance"]
["5921",""]
["5931","JIP 51"]
["5976","IROP - Návazná péče"]
["5982","Rezidenti 2015 - nelékařské obory"]
["6001","Vedení klinického pracoviště"]
["6002","OP LZZ vzdělávání lékařů"]
["6005","IOP - Mod.obn.přístr.vyb.traumatologického c."]
["6022","Ambulance"]
["6023","Triážová ambulance - COVID-19"]
["6024","Ambulance"]
["6025","LPS dospělá"]
["6026","Akutní traumatologická ambulance"]
["6027","Odběrový stan - COVID-19"]
["6028","Traumatologický plán FNOL"]
["6029","Emergency"]
["6083","Rezidenti 2016 - ošetřovatelská a intenzivní péče"]
["6087","URGENT: rezidenti 2020 - lékaři"]
["6088","Rezidenti 2017 - nelékařské obory"]
["6206","Centrum klinického výzkumu"]
["8101","Klinická hodnocení - I. Interní klinika"]
["8102","Klinická hodnocení - II. Interní klinika"]
["8103","Klinická hodnocení - III. Interní klinika"]
["8104","Klinická hodnocení - I. Chirurgická klinika"]
["8105","Klinická hodnocení - II. Chirurgická klinika"]
["8106","Klinická hodnocení - Neurochirurgická klinika"]
["8107","Klinická hodnocení - Klinika anesteziologie a resuscitace"]
["8108","Klinická hodnocení - Porodnicko-gynekologická klinika"]
["8109","Klinická hodnocení - Novorozenecké oddělení"]
["8110","Klinická hodnocení - Dětská klinika"]
["8111","Klinická hodnocení - Ortopedická klinika"]
["8112","Klinická hodnocení - Urologická klinika"]
["8113","Klinická hodnocení - Otolaryngologická klinika"]
["8114","Klinická hodnocení - Oční klinika"]
["8115","Klinická hodnocení - Oddělení alergologie a kl.imun."]
["8116","Klinická hodnocení - Klinika plicních nemocí a tuberkulózy"]
["8117","Klinická hodnocení - Neurologická klinika"]
["8118","Klinická hodnocení - Klinika psychiatrie"]
["8119","Klinická hodnocení - Klinika pracovního lékařství"]
["8120","Klinická hodnocení - Klinika chorob kožních a pohlavních"]
["8121","Klinická hodnocení - Onkologická klinika"]
["8122","Klinická hodnocení - Klinika nukleární medicíny"]
["8124","Klinická hodnocení - Klinika zubního lékařství"]
["8125","Klinická hodnocení - Klinika ústní, čelistní a obl. chir."]
["8126","Klinická hodnocení - Oddělení rehabilitace"]
["8127","Klinická hodnocení - Klinika TVL a kardiovask rehabilitace"]
["8128","Klinická hodnocení - Ústav lékařské genetiky a fet. med."]
["8129","Klinická hodnocení - Oddělení plastické a estet. chirurgie"]
["8130","Klinická hodnocení - Oddělení geriatrie"]
["8131","Klinická hodnocení - Traumatologické oddělení"]
["8132","Klinická hodnocení - Hemato-onkologická klinika"]
["8133","Klinická hodnocení - Oddělení klinické biochemie"]
["8134","Klinická hodnocení - Radiologická klinika"]
["8135","Klinická hodnocení - Transfuzní oddělení"]
["8136","Klinická hodnocení - Oddělení klinické logopedie"]
["8137","Klinická hodnocení - Ústav klinické a molekulární patologie"]
["8138","Klinická hodnocení - Ústav soud. lékařství a medicin.práva "]
["8139","Klinická hodnocení - Oddělení klinické psychologie"]
["8140","Klinická hodnocení - Ústav mikrobiologie"]
["8141","Klinická hodnocení - Ústav imunologie"]
["8143","Klinická hodnocení - Ústav farmakologie"]
["8144","Klinická hodnocení: Laboratoř experimentální medic"]
["8145","Klinická hodnocení - Sociální oddělení"]
["8146","Klinická hodnocení - Transplantační centrum"]
["8147","Klinická hodnocení - Centrální operační sály"]
["8148","Klinická hodnocení - Lékárna"]
["8150","Klinická hodnocení - Kardiochirurgická klinika"]
["8153","Klinická hodnocení - Oddělení lék. fyziky a rad. ochrany"]
["8156","Klinická hodnocení - Oddělení centrální sterilizace "]
["8159","Klinická hodnocení - Oddělení int. péče chirurg. oborů"]
["8160","Klinická hodnocení - Oddělení urgentního příjmu"]
["8501","Prof. MUDr. Petr Kaňovský, CSc. - NEUROL"]
["8502","Doc.MUDr. Mgr. Milan Raška, Ph.D. - IMUNOL"]
["8503","Prof. MUDr. Miloš Táborský, CSc., FESC, MBA - I.IK"]
["8504","Prof. MUDr. Miloš Táborský, CSc., - I.IK - TAČR"]
["8505","MUDr. Martin Nevrlý, Ph.D. - NEUROL"]
["8506","MUDr. Petr Džubák, Ph.D. - DK/GEN"]
["8507","Prof. MUDr. Vítězslav Kolek, DrSc. - PLIC"]
["8508","Prof. MUDr. Miloš Táborský, CSc., FESC, MBA - I.IK"]
["8509","Doc. MUDr. Daniel Šaňák, PhD. - NEUROL"]
["8510","Doc. MUDr. Petr Hamal, PhD. - MIKRO"]
["8511","Prof. MUDr. Radovan Pilka, PhD. - PORGYN"]
["8512","Grant: MUDr. Martin Loveček, PhD. - I. CHIR"]
["8513","Grant: MUDr. Martin Šín, PhD., FEBO - OČNÍ"]
["8514","Grant: Doc. MUDr. Miroslav Vaverka, CSc. - NEUROCH"]
["8515","Grant: Doc. Dr. Ing. Eva Kriegová - IMUNO"]
["8516","Grant: Prof. RNDr. Tomáš Adam, PhD. - OKB"]
["8517","Grant: Ing. David Kula, PhD., MBA - I.IK"]
["8518","Grant: MUDr. Jan Hálek, Ph.D."]
["8519","Grant: Ing. Antonín Hlavinka"]
["8531","MUDr. Tomáš Szotkowski, Ph.D. - HOK"]
["8532","Prof.MUDr. Zdeněk Kolář, CSc. - PATOL"]
["8533","MUDr. Milan Král, Ph.D. - UROL"]
["8534","Doc. MUDr. František Mrázek, Ph.D. - IMUNOL"]
["8535","MUDr. Vladimír Balík, Ph.D. - NEUROCHIR"]
["8536","Doc. RNDr. Radek Vrtěl, Ph.D. - GENETIKA"]
["8537","MUDr. Michela Kaiserová - NEUROL"]
["8538","MUDr. David Vrána, Ph.D. - ONKO"]
["8539","MUDr. Tomáš Pika, Ph.D. - HOK"]
["8540","Dr. Ing. Eva Kriegová - IMUNO"]
["8541","MUDr. Richard Salzman, Ph.D. - ORL"]
["8542","Prof. MUDr. Jiří Ehrmann, Ph.D. - PATOL"]
["8543","Prof. MUDr. Bohuslav Melichar, Ph.D. - ONKO"]
["8544","MUDr. Jana Volejníková, Ph.D. - DK"]
["8545","MUDr. Hana Študentová, Ph.D. - ONKO"]
["8546","Dr. Ing. Eva Kriegová - IMUNO"]
["8547","Doc. MUDr. Vít Procházka, Ph.D. - HOK"]
["8548","MUDr. Pavel Skalický, Ph.D. - I.CHIR"]
["8549","Prof. MUDr. Miloš Táborský, CsC. - I.IK - TAČR"]
["8550","MUDr. Hana Študentová, Ph.D. - ONKO - GAČR"]
["8551","Doc. MUDr. Vladimír Študent, PhD. - UROL"]
["8552","Doc. MUDr. Jiří Minařík, PhD. - HOK"]
["8553","MUDr. Hana Študentová, Ph.D. - ONKO"]
["8554","MUDr. Pavel Skalický, PhD. - I.CHIR"]
["8555","Doc. RNDr. Radek Vrtěl, PhD. - GENETIKA"]
["8556","MUDr. Tomáš Veverka, PhD. - NEUROL"]
["8557","MUDr. Petr Šantavý, PhD. - KARDIOCHIR"]
["8558","MUDr. Filip Čtvrtlík, PhD. - RTG"]
["8559","MUDr. JUDr. Dušan Klos, Ph.D. - I.CHIR"]
["8560","Mgr. Lenka Kocourková - LEM"]
["8561","MUDr. Ondřej Krystyník - III. IK"]
["8562","Mgr. Taťána Štosová, Ph.D. - MIKRO"]
["8563","Doc. MUDr. Jan Minařík, Ph.D. - HOK"]
["8564","MUDr. Jan Přeček, Ph.D. - I.IK"]
["8565","Prof. MUDr. Ing. Petr Hluštík, Ph.D. - NEUROL"]
["8566","MUDr. Michaela Kaiserová - NEUROL"]
["8567","MUDr. Jana Petřková, Ph.D. - I.IK"]
["8568","Prof. MUDr. Dagmar Pospíšilová, Ph.D. - DK"]
["8569","MUDr. Přemysl Falt, Ph.D. - II.IK"]
["8570","Prof. MUDr. Bohuslav Melichar, Ph.D. - ONKO"]
["8571","MUDr. Tomáš Skála, Ph.D., FESC - I.IK"]
["8572","Grant: Doc. MUDr. Petr Šantavý, Ph.D. - KARDIOCHIR"]
["8573","Grant: MUDr. Jan Přeček, PhD. - I.IK"]
["8574","Grant: Doc. MUDr. Kateřina Menšíková, PhD. - NEURO"]
["8575","Grant: Doc. MUDr. Miroslav Vaverka, CSc. - NEUROCH"]
["8576","Grant: MUDr. Vladislav Raclavský, PhD. - MIKRO"]
["8577","Grant: Prof. MUDr. Bohuslav Melichar, Ph.D. - ONKO"]
["8578","Grant: Prof. MUDr. Mgr. Milan Raška, PhD. - IMUNO"]
["8579","Grant: Prof. MUDr. Dagmar Pospíšilová, PhD. - DK"]
["8580","Grant: Doc. MUDr. Martin Doležel, PhD. - ONKOL"]
["8581","Grant: Doc. MUDr. Ondřej Urban, PhD. - II. IK"]
["8582","Grant: MUDr. Tomáš Skála, PhD. FESC - I. IK"]
["8599","Granty - pomocné středisko"]
["8617","MUDr. Michal Král - NEUROL"]
["8618",""]
["8619","Grant: Doc. MUDr. Jiří Gallo, Ph.D. - ORTOP"]
["8620","Doc.MUDr.Marek Ĺubušký, Ph.D. - PORGYN"]
["8621","Prof.MUDr. Petr Kaňovský, CSc. - NEUROL"]
["8622","Grant: Doc.MUDr. Edgar Faber, CSc. - HOK"]
["8623",""]
["8625","Doc. MUDr. Milan Adamus, Ph.D. - KARIM"]
["8626","Doc. MUDr. Jiří Gallo, Ph.D. - ORTOP"]
["8627","Prof. MUDr. Vladimír Mihál, CSc. - DK"]
["8628","Doc. MUDr. Čestmír Neoral, CSc. - I.CHIR"]
["8629","Doc. MUDr. Daniel Šaňák, Ph.D. - NEUROL"]
["8631","Doc. MUDr. Petr Utíkal, Ph.D. - 2.CHIR"]
["8632","MUDr. Petr Jakubec - PLICNÍ"]
["8633","Mgr. T. Štosová, Ph.D./MUDr. M.Sedláková, Phd.D. - MIKRO"]
["8634","MUDr. Zuzana Heřmanová - IMUNOL"]
["8635","Mgr. Luděk Slavík, Ph.D. - HOK"]
["8636","Mgr. T. Štosová, Ph.D./MUDr. M.Sedláková, Phd.D. - MIKRO"]
["8637","MUDr. Tomáš Pika, Ph.D. - 3.IK"]
["8638","MUDr. Vít Procházka - HOK"]
["8639","Prof. MUDr. Jiří Klein, Ph.D. - ONKOL"]
["8640","MUDr. Pavel Otruba, MBA - NEUROL"]
["8641","Doc. MUDr. Marie Nakládalová, Ph.D. - PRAC"]
["8642","MUDr. Tomáš Wanek - NEUROCHIR "]
["8643","Doc.MUDr.Milan Adamus, Ph.D. - KARIM"]
["8644","Doc. MUDr. Martin Procházka, Ph.D. - PORGYN"]
["8645","Prof. MUDr. Vítězslav Kolek, DrSc. - PLIC"]
["8646","Doc. MUDr. Dagmar Pospíšilová, Ph.D. - DK"]
["8647","Doc. MUDr. Igor Čižmář, Ph.D. - TRAUMA"]
["8648","Doc. Mgr. Jiří Drábek, Ph.D.  - TAČR"]
["8649","Prof. MUDr. Jiří Gallo, Ph.D. - ORTOP"]
["8665","Grant: prof. MUDr. Zdeněk Kolář, CSc. - PATOL"]
["8667","MUDr. Luděk Raida, Ph.D. - HOK"]
["8671","Grant: Doc. MUDr. Petr Utíkal, Ph.D. - 2 CHIR"]
["8672","Grant: MUDr. Ondřej Kalita, Ph.D. - NCHIR"]
["8673","Grant: Doc. MUDr. Ivana Oborná, Ph.D. - PORGYN"]
["8676","Prof. MUDr. Vítězslav Kolek, DrSc. - PLIC"]
["8680","Doc.MUDr. Tomáš Papajík, CSc. - HOK"]
["8681","Prof.MUDr. Martin Petřek, CSc. - OKB"]
["8682","Prof.MUDr. Martin Petřek, CSc. - OKB"]
["8683","Prof.MUDr. Vítězslav Kolek, DrSc. - PLIC"]
["8684","Prof.MUDr. Josef Zadražil, CSc - 3.IK"]
["8685","MUDr. Karel Cwiertka, Ph.D. - ONKOL"]
["8686","Doc.MUDr. Radovan Pilka, Ph. D. - PORGYN"]
["8687","MUDr. Ivona Grygárková - PLIC"]
["8688","Prof. MUDr. Jiří Ehrmann, Ph. D. - PATOL"]
["8689","Prof.MUDr. Petr Hluštík, Ph.D. - NEUROL"]
["8690","Doc.MUDr. Tomáš Papajík, CSc. - HOK"]
["8691","MUDr. Ondřej Kalita, Ph.D. - NCHIR"]
["8692","Grant: MUDr. Jan Gregar - 2.IK"]
["8693","Prof.MUDr. Karel Indrák, DrSc. - HOK"]
["8694","Doc.MUDr.Petr Utíkal, Ph.D. - 2. CHIR"]
["8695","Grant: Doc. MUDr. Peter Ondra, CSc. - SOUDNÍ"]
["8696","MUDr. Jan Gregar - 2. IK"]
["8697","Prof.MUDr. Pavel Horák, CSc. - 3.IK"]
["8698","MUDr. Dušan Klos, Ph. D. - I.CHIR"]
["8699","Granty - pomocné středisko"]
["8705","RIV: MUDr. Kateřina Čerňanová"]
["8709","RIV: MUDr. Aleš Grambal, PhD."]
["8710","RIV: MUDr. Štefan Trnka"]
["8711","RIV: doc. Mgr. Jan Bouchal, PhD."]
["8712","RIV: prof. MUDr. Jiří Gallo, PhD."]
["8713","RIV: MUDr. Matěj Halaj"]
["8715","RIV: MUDr. Karel Huml"]
["8716","RIV: MUDr. Beáta Hutyrová, PhD."]
["8719","RIV: MUDr. Hana Klosová, PhD."]
["8720","RIV: MUDr. Petr Kolář, PhD."]
["8721","RIV: MUDr. Andrea Smržová"]
["8724","RIV: MUDr. Vladimír Študent, PhD."]
["8725","RIV: MUDr. Helena Urbánková"]
["8726","RIV: Mgr. Petr Vrtěl"]
["8729","RIV: prof. MUDr. Vít Procházka, PhD."]
["8730","RIV: MUDr. Špička, PhD."]
["8735","RIV: MUDr. Petra Hübnerová"]
["8736","RIV: MUDr. Josef Chudáček"]
["8737","RIV: MUDr. Jana Janečková, PhD."]
["8738","RIV: MUDr. Jan Schovánek, PhD."]
["8739","RIV: doc. MUDr. Martin Šimek, PhD."]
["8752","RIV: 2016 - Doc. MUDr. Daniel Šaňák, Ph.D."]
["8753","RIV: MUDr. Richard Salzmann, Ph.D."]
["8754","RIV: 2016 - Doc. MUDr. David Karásek, Ph.D."]
["8755","RIV - MUDr. Roman Hájek, Ph. D. "]
["8757","RIV: 2016 - MUDr. JUDr. Dušan Klos, Ph.D."]
["8758","RIV: 2016 - MUDr. Tomáš Pika, Ph.D."]
["8760","RIV: RNDr. Martin Novák, Ph.D."]
["8761","RIV - MUDr. Jana Volejníková, Ph. D. "]
["8762","RIV - Doc. MUDr. David Karásek, Ph. D. "]
["8763","RIV: 2017 - MUDr. Richard Salzmann, Ph.D."]
["8764","RIV: 2017 - MUDr. Kateřina Menšíková, Ph.D."]
["8765","RIV - Doc. MUDr. František Mrázek, Ph. D. "]
["8766","RIV - MUDr. Adam Kuba"]
["8767","RIV - Prof. MUDr. Jiří Gallo, Ph. D. "]
["8768","RIV - Doc. MUDr. Karel Krejčí, Ph. D. "]
["8769","RIV: 2017 - Doc. MUDr. Radek Vodička, Ph.D."]
["8770","RIV: MUDr. Barbora Ludíková, Ph.D."]
["8771","RIV: 2017 - Doc. MUDr. Radek Vrba, Ph.D."]
["8772","RIV: 2017 - Mgr. Luděk Slavík, Ph.D."]
["8773","RIV - MUDr. Jan Hálek, Ph.D."]
["8774","RIV: 2017 - MUDr. Milan Král, Ph.D."]
["8775","RIV: 2017 - MUDr. Hana Suchánková, Ph.D."]
["8776","RIV: 2017 - MUDr. Jiří Kysučan, Ph.D."]
["8777","RIV: Prof. MUDr. Radovan Pilka, Ph.D."]
["8778","RIV: 2017 - Mgr. Lukáš Najdekr"]
["8779","RIV - MUDr. Anna Medková"]
["8780","RIV - MUDr. Eva Karásková"]
["8781","RIV - Doc. MUDr. Jiří Minařík, Ph. D. "]
["8782","RIV - RNDr. Pavlína Čapková, Ph. D. "]
["8783","RIV - MUDr. Eva Klásková, Ph. D. "]
["8784","RIV - MUDr. Jan Hanuliak"]
["8785","RIV - Doc. MUDr. Martin Hutyra, Ph. D. "]
["8786","RIV - MUDr. Pavel Hok"]
["8787","RIV - Dr. Gvansta Kharaishvili, Ph. D. "]
["8788","RIV - MUDr. Richard Salzman, Ph. D. - MEX "]
["8789","RIV - Doc. MUDr. Kateřina Menšíková, Ph. D. - MEX "]
["8790","Institucionální podpora - RIV"]
["8791","RIV - Doc. Mgr. Luděk Slavík, Ph. D. - MEX "]
["8792","RIV - Prof. MUDr. Jiří Gallo, Ph. D. - MEX "]
["8793","RIV: prof. MUDr. Milan Raška, PhD. - MEX"]
["8794","RIV: MUDr. Martin Loveček, PhD. - MEX"]
["8795","RIV: doc. MUDr. Martin Vrba , PhD. - MEX"]
["8796","RIV: doc. MUDr. Přemysl Falt, PhD. - MEX"]
["8797","RIV: prof. MUDr. Jiří Gallo, PhD. - MEX"]
["8798","RIV: prof. MUDr. Miloš Táborský, PhD. - MEX"]
["8799","RIV: doc. MUDr. Radek Vodička, PhD. - MEX"]
["8981","Úsek klinických studií"]
["8988","Pomocné středisko"]
["8999","Rozdíly zdravotních pojišťoven"]
["9001","Úsek ředitele"]
["9002","Kaple konto darů"]
["9003","Etická komise"]
["9004",""]
["9005","IOP Mod.a obnova přístroj.vyb.komplex.rehab.péče"]
["9006",""]
["9007",""]
["9008","IOP - Mod.obn.přístr.vyb.c.k.onkologické p. II"]
["9009","IOP - Mod.obn.přístr.vyb.cerebrovaskulárního centra FNOL"]
["9010","Organizace plesu FN"]
["9011","IOP- Mod.obn.přistr.vyb.komplex.kardiovas.centra"]
["9012","IOP - Mod.tech.vyb.v oblasti prevence nozokomiál.infek."]
["9013",""]
["9014",""]
["9015","IOP - Mod.obn.přístr.vyb.traumatologického c."]
["9016","Projekt OP RLZ"]
["9017",""]
["9018","Projekt WHO - HPH standardy"]
["9019",""]
["9021","Úsek léčebné péče"]
["9022","Konto darů - vzdělávání FNOL"]
["9023",""]
["9024",""]
["9025","Nemocniční dietolog"]
["9026","IOP - Mod.tech.vyb.v oblasti prevence nozokomiál.infek."]
["9027","Dárcovský konzultant"]
["9028","Oddělení vědy a výzkumu"]
["9029","Paliativní péče"]
["9031","Odbor hlavní sestry"]
["9032","Oddělení léčebné výživy"]
["9033",""]
["9034","Projekt vzdělávání nelék. oborů ve FNOL "]
["9035","E-learningová podpora výuky zdrav.info.pro střed.zdrav.personál"]
["9036","Dobrovolnické centrum FNOL"]
["9041","Útvar ekonomiky a zdravotních pojišťoven"]
["9042","Dotace PAP"]
["9043",""]
["9044",""]
["9045",""]
["9046","Ostatní náklady - pouze FKSP"]
["9051","Útvar hospodářsko technické správy"]
["9052",""]
["9054",""]
["9058",""]
["9059",""]
["9060",""]
["9061","Odbor investic"]
["9062",""]
["9063","IU: Odbor hlavního energetika"]
["9064",""]
["9065",""]
["9066",""]
["9067",""]
["9068",""]
["9069",""]
["9071","Personální úsek"]
["9072",""]
["9074",""]
["9075","IOP - Mod.obn.přístr.vyb.traumatologického cen. II"]
["9076","Školení KPR"]
["9077","IOP - Mod.obn.přístr.vyb.c.k.onkologické p. III"]
["9081","Úsek informačních technologií"]
["9082","Odbor informatiky"]
["9083",""]
["9084","Oddělení centrální spisovny"]
["9085","Oddělení telefonní ústředny"]
["9086","NIS (Nemocniční inf. systém)"]
["9087",""]
["9088",""]
["9089","IOP-zvýš.efekt.v oblasti diag. procesů (RTG)"]
["9091","Obchodní úsek"]
["9092",""]
["9093",""]
["9094",""]
["9095",""]
["9096","Odbor marketingu"]
["9097",""]
["9101","Petřivalského - Rapantův den "]
["9102","Markův den "]
["9103","Světový den dárců krve "]
["9104","Workshop vrchních sester a vedoucích laborantů "]
["9105","Pracovní konference III. Interní kliniky "]
["9106","Pracovní den - sekce mladých chirurgů "]
["9107","Dermatologická konference "]
["9108","Hirschův den "]
["9109","Pracovní seminář region. ARO a HDS CTR FNOL "]
["9110","Den sester perioperační péče "]
["9111","Olomoucký podiatrický pracovní den "]
["9112","Luklův kardiologický den "]
["9113","Regionálni sesterská kardiologická konference "]
["9114","Kampaň - dárcovství krve"]
["9115","Konference prenatál.diagnostiky.a fetální medicíny"]
["9116","Moravský kazuistický seminář - Kožní klinika"]
["9117","Kardiologická ROAD SHOW"]
["9118","Konference pediatrů a dětských sester"]
["9119","II. IK - nové možnosti v léčbě chronické hepatitidy C"]
["9120","Lymeská borelióza"]
["9121","Krajský alergologicko-imunologický seminář"]
["9122","Konto darů - vzdělávání-konference FNOL"]
["9123","Bezpečná aplikace do cévního řečiště"]
["9124","Hospital Management"]
["9125","Novinky v asistované reprodukci"]
["9126","II. IK - Stop dekubitům"]
["9127","Dětská klinika - Seminář mladých lékařů"]
["9128","Echokardiografický kurz I+II"]
["9129","Hojení ran v kostce"]
["9130","Celostátní konference DNA diagnostiky"]
["9131","Seminář pro odborníky pro nemoci z povolání"]
["9132","Seminář \"Nový zákon o veřejných zakázkách\""]
["9133","Kongres českých a slovenských dětských chirurgů"]
["9134","Odborná konference plicní kliniky"]
["9135","Simulační medicína KARIM"]
["9136","OKB - workshop"]
["9137","Seminář - náročné situace zdrav. praxe"]
["9138","Rozmaričovy soudně-lékařské pracovní dny"]
["9139","Workshop - Bioremodelace laxity kůže"]
["9140","Seminář \"Přínos molekulární detekce patogenů\""]
["9141","Seminář \"Aktuality v nemocničním lékarenství\""]
["9142","Pracovní dny chirurgie baze lební"]
["9143","Kvalifikační kurz SANITÁŘ"]
["9144","Péče o pacienty se žilními vstupy"]
["9145","Zavádění žilních vstupů pod UZ kontrolou"]
["9146","Péče o pacienty s parenterální výživou - domácí prostředí"]
["9147","Český národní kongres léčby malignit peritoneálního povrchu"]
["9148","MA FNOL: Konference a vzdělávací akce TO"]
["9149","MA FNOL: Pracovní dny OKB - dědičné metab. poruchy"]
["9150","MA FNOL: Konference PORGYN"]
["9151","MA FNOL: Běh za zdraví"]
["9152","MA FNOL: Spolupráce geriatrie a následné péče"]
["9153","MA FNOL: Gastrokurzy"]
["9154","MA FNOL: Olomouc Live endoskopy"]
["9155","MA FNOL: Best of Astro"]
["9204","Areál FNOL"]
["9205","Projekt SMO-zpřístupnění fort. pevnosti v areálu FNOL"]
["9206","Projekt OL kraje-zpřístupnění fort. pevnosti v areálu FNOL"]
["9207","\"Pevnůstka\" - archív "]
["9208","Údrž. Provoz.: OPŽP Regenerace zeleně v FN Olomouc"]
["9209","Areál - ulice Profesora Fuky"]
["9301","Sklad ZPr (sledování režijních nákladů pracoviště)"]
["9305","Ostatní provozy,sklady,stěhovací četa"]
["9306","Ostraha FNOL"]
["9308","Parková skupina"]
["9401","Provoz prádelny"]
["9402","Provoz dopravy - sanitní - převoz pacientů ve FNOL"]
["9403","Provoz dopravy - osobní"]
["9404","Provoz dopravy - nákladní"]
["9405","Provoz dopravy - sanitní - převoz zdrav. pojišťovny"]
["9409","Údržba stavební"]
["9410","Údržba ZVIT"]
["9411","Provoz potrubní pošty"]
["9412","Poro. služby: Provoz distribuce prádla"]
["9501","Provoz stravování - ostatní stravování"]
["9502","Provoz stravování - tablet, pacientská strava"]
["9503","Provoz stravování - Kantýna"]
["9504",""]
["9505","Provoz stravování - vlastní výroba"]
["9506","IOP - Mod.tech.vyb.v oblasti prevence nozokomiál.infek."]
["9601","Ubytovny"]
["9655","Byty "]
["9701","Stavební úpravy neurologie"]
["9702","Přístavba objektu P pro HOK "]
["9703","Stavby: SÚ dospávací haly v objektu A /KARIM"]
["9704","SÚ realizace KTVL"]
["9705","Parkoviště u lékárny"]
["9706","Rekonstrukce zákrokového sálu - ORT"]
["9707","Stavby: Vjezdový závorový systém"]
["9708","SÚ modernizace jídelny - Provoz stravování"]
["9710","Parkování pod Dětskou klinikou"]
["9712","Stavby: SÚ operační sál č. 2 v 3NP / NCHIR"]
["9713","Napojení areálu Hněvotínská"]
["9714","SÚ objektu M1 a M2 - NEUR"]
["9715","SÚ vstupů do budovy D1 a D2"]
["9716","Stavby: SÚ 1.NP a 1.PP/ORL"]
["9717","Stavby: SÚ JIRP / DK"]
["9719","Stavby: SÚ objektu D - únikové cesty"]
["9720","Stavby: Lapák tuků"]
["9721","Stavby: Onkologický stacionář"]
["9723","Stavby: SÚ pracoviště sterilizace v 1. PP/ORT"]
["9724","Stavby: Rekonstrukce 1.PP skladu potravin"]
["9725","Stavby: SÚ 2.NP objektu A"]
["9736","Stavby: Zateplení KZL"]
["9738","Stavby: SÚ RTG kliniky - budova A/1.PP"]
["9739","Stavby: SÚ objektu U - PSY"]
["9743","Stavby: SÚ pro přemístění 1 IK"]
["9745","SÚ JIP a arytmologie I. IK"]
["9751","Potrubní pošta"]
["9753","Stavby: Ozařovací rentgen ONK"]
["9754","Zateplení 3IK + KNM"]
["9756","Stavby: Centralizace dětské operativy"]
["9759","Zateplení  OKB "]
["9760","Stavby: SÚ pro IOP ONKO II - RTG"]
["9761","Stavby: SÚ pro IOP ONKO II - KNM"]
["9762","Zateplení ORT"]
["9763","Investice - výstavba TO"]
["9764","Zateplení DK"]
["9765","Příprava rekonstrukce hlavní budovy"]
["9767","Zateplení a bezbariérovost KZL"]
["9768","Novostavba 2IK a Geriatrie"]
["9769","SÚ budovy D2 - zřízení NIP a DIOP"]
["9770","Úprava LEK v budově A"]
["9772","Přesun laboratoří HOK z budovy K do budovy P"]
["9773","Stavby: Zdroj chladu pro objekt \"A\""]
["9774","Stavby: Chodníky areálu FNOL"]
["9776","Stavby: Fort Tafelberg, úprava jižního bloku"]
["9777","Stavba - NTMC Národní telemedicínské centrum"]
["9779","Laboratoře GEN/T"]
["9780","Stavby: Rekonstrukce výtahů"]
["9782","Stavby: Nástavba budovy A"]
["9783","Radiofarmaka KNM"]
["9788","Stavby: SÚ objektu I - 1.PP / OKB"]
["9792","Stavby: Úprava prac. děts. alergolog. a pneumolog."]
["9799","Stavby: Lékárna - novostavba"]
["9801","Krizová připravenost - MZ"]
["9802","Zdravotní výchova - MZ"]
["9803","Výuka studentů - MZ"]
["9804","Čítárna - knihovna - MZ"]
["9805","Program bezpečnosti a kvality zdrav. péče - MZ"]
["9806","Krizová připravenost - MZ - příjem hromad.postižení osob"]
["9807","Krizová připravenost - Traumateam ČR - RAFEX 2014"]
["9808","TranMZČR: Zvýšení ochr. měkkých cílů v res.zdr.-MZ"]
["9809","TranMZČR: Psychosoc. podpora zdrav. prac.v 2020-MZ"]
["9810","TranMZČR: Zabezpečení svoláv. a varovného sys.-MZ"]
["9811","TranMZČR: Zvýšení ochr.měkkých cílů-2-zubní kl.-MZ"]
["9812","Refundace ZO OS, SČL,Unie sester "]
["9813","MEDEVAC"]
["9814","Konference \"Zdraví v Evropě\" (Norské fondy)"]
["9815","Komunikační kampaň FNOL (nekuřácká nemocnice)"]
["9816","Projekt WHO - HPH konference "]
["9817","Personální stabilizace ve zdravotnictví"]
["9818","Systém psychosociální intervenční služby SPIS"]
["9819","TranMZČR: Bezpečnost a kvalita zdravotní péče"]
["9901","Pronájmy Areál FNO"]
["9910","Pronájmy Areál Hněvotínská vč.kotelny"]
["9920","Pronájmy Areál Heliport"]
["9930","Pronájmy Areál Karafiátova"]
["9940","Pouze energie"]
["9950","Pronájem reklamních ploch"]
["9998","Daň z nemovitosti + různé"]
["9999","Pomocné středisko pro inter. potřeby"]