{"text_format":"1","workbook":"xlsx","n_sheets":6,"sheets":["Intro","Summary","1_Původní","2_Upravený","3_Rozdíly","CisNS"],"not_rendered":{"charts":0,"images":2,"macros":1,"external_links":0,"defined_names":1,"comments":0,"pivot_tables":0},"unopened":[],"bounds":{"document_bytes":16777216,"sheet_cells":100000,"rows_first":2000,"rows_last":500,"rows_between":2000,"halvings":0,"cell_chars":16384,"cell_head_chars":4096},"cells_cut":0,"cells_raw":0,"read":"whole","date_system":"1900"}

{"sheet":"Intro","index":0,"n_rows":5,"n_cols":2,"rows_kept":5,"cut":false,"hidden":false,"merged":[]}
[]
[null,"Pro správnou funkčnost šablony je zapotřebí povolit makra."]
[null,"A jelikož nemáte makra povolená, zobrazuje se tento list."]
[null,"Makra povolíte v menu Soubor/Možnosti/Centrum zabezpečení/Nastavení centra zabezpečení/ Nastavení maker a zaškrtněte volbu Povolit všechny makra"]
[null,"Po povolení maker šablonu zavřete a otevřete znovu."]

{"sheet":"Summary","index":1,"n_rows":30,"n_cols":7,"rows_kept":30,"cut":false,"hidden":true,"merged":[[7,3,7,5],[7,1,8,2],[26,1,27,2],[26,3,27,3]]}
[null,null,null,null,null,null,{"$f":"SUM(F:F)","v":0}]
[null,"Plánovací proces 2021 - šablona pro úpravu návrhu rozpočtu analytického účtu do středisek a měsíců"]
[]
[null,"Garant","OPP"]
[null,"Jméno","Ing. Jarmila Neudörflerová"]
[null,"Email","Jarmila.Neudorflerova@fnol.cz"]
[]
[null,"Analytický účet",null,"Rozpočet"]
[null,null,null,"1_Původní","2_Upravený","3_Rozdíly"]
[null,64908009,"Smlouva o účelově vázané úplatě",{"$f":"IFERROR(VLOOKUP(B10,'1_Původní'!A:P,16,FALSE),0)","v":215000},{"$f":"IFERROR(VLOOKUP(B10,'2_Upravený'!A:P,16,FALSE),0)","v":215000},{"$f":"ROUND(E10-D10,0)","v":0}]
[null,64924438,"Výkony etické komise",{"$f":"IFERROR(VLOOKUP(B11,'1_Původní'!A:P,16,FALSE),0)","v":2300000},{"$f":"IFERROR(VLOOKUP(B11,'2_Upravený'!A:P,16,FALSE),0)","v":2300000},{"$f":"ROUND(E11-D11,0)","v":0}]
[null,64924439,"Klinické hodnocení - tuzemci (81xx,9003,9028)",{"$f":"IFERROR(VLOOKUP(B12,'1_Původní'!A:P,16,FALSE),0)","v":35199999.999700002},{"$f":"IFERROR(VLOOKUP(B12,'2_Upravený'!A:P,16,FALSE),0)","v":35199999.999700002},0]
[null,64924440,"Klinické hodnocení - EU (81xx,9003,9028)",{"$f":"IFERROR(VLOOKUP(B13,'1_Původní'!A:P,16,FALSE),0)","v":6339999.9998000003},{"$f":"IFERROR(VLOOKUP(B13,'2_Upravený'!A:P,16,FALSE),0)","v":6339999.9707000013},0]
[null,64924441,"Klinické hodnocení - 3.země (81xx,9003,9028)",{"$f":"IFERROR(VLOOKUP(B14,'1_Původní'!A:P,16,FALSE),0)","v":6899999.9997999985},{"$f":"IFERROR(VLOOKUP(B14,'2_Upravený'!A:P,16,FALSE),0)","v":6899999.9997999985},0]
[null,67101000,"Transfery MZ - ostatní",{"$f":"IFERROR(VLOOKUP(B15,'1_Původní'!A:P,16,FALSE),0)","v":16961000},{"$f":"IFERROR(VLOOKUP(B15,'2_Upravený'!A:P,16,FALSE),0)","v":16961000},0]
[null,67101001,"Transfery MZ na VaV - věcné náklady",{"$f":"IFERROR(VLOOKUP(B16,'1_Původní'!A:P,16,FALSE),0)","v":2828999.9999000002},{"$f":"IFERROR(VLOOKUP(B16,'2_Upravený'!A:P,16,FALSE),0)","v":2829000},0]
[null,67101002,"Transfery MZ na VaV - mzdové náklady",{"$f":"IFERROR(VLOOKUP(B17,'1_Původní'!A:P,16,FALSE),0)","v":3874000},{"$f":"IFERROR(VLOOKUP(B17,'2_Upravený'!A:P,16,FALSE),0)","v":3874000},0]
[null,67101006,"Transfery MZ na rezidenční místa",{"$f":"IFERROR(VLOOKUP(B18,'1_Původní'!A:P,16,FALSE),0)","v":8150999.9999999991},{"$f":"IFERROR(VLOOKUP(B18,'2_Upravený'!A:P,16,FALSE),0)","v":8150999.9999999991},0]
[null,67101010,"Transfery MZ - RIV (institucionální podpora)",{"$f":"IFERROR(VLOOKUP(B19,'1_Původní'!A:P,16,FALSE),0)","v":8000000.0001000008},{"$f":"IFERROR(VLOOKUP(B19,'2_Upravený'!A:P,16,FALSE),0)","v":8000000},0]
[null,67101011,"Transfery MZ - MEDEVAC (humanitární program)",{"$f":"IFERROR(VLOOKUP(B20,'1_Původní'!A:P,16,FALSE),0)","v":403000},{"$f":"IFERROR(VLOOKUP(B20,'2_Upravený'!A:P,16,FALSE),0)","v":403000},0]
{"$rows_left_out":11}
{"sheet":"1_Původní","index":2,"n_rows":246,"n_cols":16,"rows_kept":246,"cut":false,"hidden":true,"merged":[]}
["Legenda",null,"Hodnoty v CZK"]
["Účet","Název účtu"]
[null,"NS","Název NS",{"$f":"MID(Summary!$B$2,18,4)&\"01\"","v":"202101"},{"$f":"MID(Summary!$B$2,18,4)&\"02\"","v":"202102"},{"$f":"MID(Summary!$B$2,18,4)&\"03\"","v":"202103"},{"$f":"MID(Summary!$B$2,18,4)&\"04\"","v":"202104"},{"$f":"MID(Summary!$B$2,18,4)&\"05\"","v":"202105"},{"$f":"MID(Summary!$B$2,18,4)&\"06\"","v":"202106"},{"$f":"MID(Summary!$B$2,18,4)&\"07\"","v":"202107"},{"$f":"MID(Summary!$B$2,18,4)&\"08\"","v":"202108"},{"$f":"MID(Summary!$B$2,18,4)&\"09\"","v":"202109"},{"$f":"MID(Summary!$B$2,18,4)&\"10\"","v":"202110"},{"$f":"MID(Summary!$B$2,18,4)&\"11\"","v":"202111"},{"$f":"MID(Summary!$B$2,18,4)&\"12\"","v":"202112"},{"$f":"MID(Summary!$B$2,18,4)&\" celkem\"","v":"2021 celkem"}]
[]
[64908009,"Smlouva o účelově vázané úplatě",null,{"$f":"SUM(D6:D7)","v":0},0,0,75568.2788,0,33948.849300000002,0,0,0,33356.640299999999,0,72126.231599999999,215000]
[null,"4803","OP - specializační vzdělávání klinických farmaceutů",0,0,0,75568.2788,0,33948.849300000002,0,0,0,33356.640299999999,0,72126.231599999999,{"$f":"SUM(D6:O6)","v":215000}]
[]
[]
[64924438,"Výkony etické komise",null,{"$f":"SUM(D10:D11)","v":132976.4454},{"$f":"SUM(E10:E11)","v":167451.82010000001},{"$f":"SUM(F10:F11)","v":201927.1949},{"$f":"SUM(G10:G11)","v":211777.30189999999},{"$f":"SUM(H10:H11)","v":226552.46249999999},{"$f":"SUM(I10:I11)","v":132976.4454},{"$f":"SUM(J10:J11)","v":216702.35550000001},{"$f":"SUM(K10:K11)","v":197002.14129999999},{"$f":"SUM(L10:L11)","v":128051.3919},{"$f":"SUM(M10:M11)","v":221627.40900000001},{"$f":"SUM(N10:N11)","v":251177.73019999999},{"$f":"SUM(O10:O11)","v":211777.30189999999},{"$f":"SUM(P10:P11)","v":2300000}]
[null,"9003","Etická komise",132976.4454,167451.82010000001,201927.1949,211777.30189999999,226552.46249999999,132976.4454,216702.35550000001,197002.14129999999,128051.3919,221627.40900000001,251177.73019999999,211777.30189999999,{"$f":"SUM(D10:O10)","v":2300000}]
[]
[]
[64924439,"Klinické hodnocení - tuzemci (81xx,9003,9028)",null,{"$f":"SUM(D14:D27)","v":885232.74040000001},{"$f":"SUM(E14:E27)","v":3562594.5710999998},{"$f":"SUM(F14:F27)","v":4268226.5504000001},{"$f":"SUM(G14:G27)","v":4238089.1201999998},{"$f":"SUM(H14:H27)","v":717306.03979999991},{"$f":"SUM(I14:I27)","v":1511824.4939000001},{"$f":"SUM(J14:J27)","v":2377216.6298000002},{"$f":"SUM(K14:K27)","v":6585884.6924999999},{"$f":"SUM(L14:L27)","v":532703.81389999995},{"$f":"SUM(M14:M27)","v":1037839.029},{"$f":"SUM(N14:N27)","v":4967132.5790000008},{"$f":"SUM(O14:O27)","v":4515949.7396999998},{"$f":"SUM(P14:P27)","v":35199999.999700002}]
[null,"8101","Klinická hodnocení - I. Interní klinika",0,0,129639.2115,0,0,0,5744.6608999999999,0,0,0,226408.97270000001,0,{"$f":"SUM(D14:O14)","v":361792.84510000004}]
[null,"8103","Klinická hodnocení - III. Interní klinika",0,0,0,0,0,0,30283.304,0,0,0,21980.143700000001,0,{"$f":"SUM(D15:O15)","v":52263.447700000004}]
[null,"8108","Klinická hodnocení - Porodnicko-gynekologická klinika",0,0,0,0,0,0,0,17581.436099999999,0,0,0,0,17581.436099999999]
[null,"8112","Klinická hodnocení - Urologická klinika",0,27662.387999999999,0,0,0,0,15097.352699999999,0,0,0,0,0,42759.740699999995]
[null,"8114","Klinická hodnocení - Oční klinika",0,93049.482099999994,0,49657.914400000001,0,0,0,0,0,0,110076.2138,0,252783.6103]
[null,"8116","Klinická hodnocení - Klinika plicních nemocí a tuberkulózy",28262.333500000001,147491.52929999999,0,119281.0156,0,26378.739799999999,0,7621.5784000000003,281574.94069999998,1098.7629999999999,46721.133600000001,11684.6994,670114.73329999996]
[null,"8117","Klinická hodnocení - Neurologická klinika",17382.556499999999,0,25872.039100000002,84926.274799999999,11163.1741,199898.75810000001,46700.442000000003,0,0,11856.427299999999,9636.3261000000002,283711.17320000002,691147.17119999998]
{"$rows_left_out":227}
{"sheet":"2_Upravený","index":3,"n_rows":247,"n_cols":21,"rows_kept":247,"cut":false,"hidden":true,"merged":[[0,16,1,16]]}
["Legenda",null,"Hodnoty v CZK",null,null,null,null,null,null,null,null,null,null,null,null,null,"Rozdíl"]
["Účet","Název účtu"]
[null,"NS","Název NS",{"$f":"MID(Summary!$B$2,18,4)&\"01\"","v":"202101"},{"$f":"MID(Summary!$B$2,18,4)&\"02\"","v":"202102"},{"$f":"MID(Summary!$B$2,18,4)&\"03\"","v":"202103"},{"$f":"MID(Summary!$B$2,18,4)&\"04\"","v":"202104"},{"$f":"MID(Summary!$B$2,18,4)&\"05\"","v":"202105"},{"$f":"MID(Summary!$B$2,18,4)&\"06\"","v":"202106"},{"$f":"MID(Summary!$B$2,18,4)&\"07\"","v":"202107"},{"$f":"MID(Summary!$B$2,18,4)&\"08\"","v":"202108"},{"$f":"MID(Summary!$B$2,18,4)&\"09\"","v":"202109"},{"$f":"MID(Summary!$B$2,18,4)&\"10\"","v":"202110"},{"$f":"MID(Summary!$B$2,18,4)&\"11\"","v":"202111"},{"$f":"MID(Summary!$B$2,18,4)&\"12\"","v":"202112"},{"$f":"MID(Summary!$B$2,18,4)&\" celkem\"","v":"2021 celkem"},{"$f":"SUM(Q4:Q8)","v":0}]
[]
[64908009,"Smlouva o účelově vázané úplatě",null,{"$f":"SUM(D6:D7)","v":0},0,0,75568.2788,0,33948.849300000002,0,0,0,33356.640299999999,0,72126.231599999999,215000,{"$f":"ROUND(P5-SUMIF('1_Původní'!A:A,'2_Upravený'!A5,'1_Původní'!P:P),0)","v":0}]
[null,"4803","OP - specializační vzdělávání klinických farmaceutů",0,0,0,75568.2788,0,33948.849300000002,0,0,0,33356.640299999999,0,72126.231599999999,{"$f":"SUM(D6:O6)","v":215000},{"$f":"IF(AND(ROUND(P6,0)<>0,B6=\"\"),\"Obrat bez specifikace NS\",\"\")","v":""},null,"Orig",{"$f":"$A$5","v":64908009}]
[null,"",{"$f":"IFERROR(VLOOKUP(B7,CisNS!$A:$B,2,FALSE),\"\")","v":""},null,null,null,null,null,null,null,null,null,null,null,null,{"$f":"SUM(D7:O7)","v":0},{"$f":"IF(AND(ROUND(P7,0)<>0,B7=\"\"),\"Obrat bez specifikace NS\",\"\")","v":""},null,null,{"$f":"T6","v":64908009},"End"]
[]
[64924438,"Výkony etické komise",null,{"$f":"SUM(D10:D11)","v":132976.4454},{"$f":"SUM(E10:E11)","v":167451.82010000001},{"$f":"SUM(F10:F11)","v":201927.1949},{"$f":"SUM(G10:G11)","v":211777.30189999999},{"$f":"SUM(H10:H11)","v":226552.46249999999},{"$f":"SUM(I10:I11)","v":132976.4454},{"$f":"SUM(J10:J11)","v":216702.35550000001},{"$f":"SUM(K10:K11)","v":197002.14129999999},{"$f":"SUM(L10:L11)","v":128051.3919},{"$f":"SUM(M10:M11)","v":221627.40900000001},{"$f":"SUM(N10:N11)","v":251177.73019999999},{"$f":"SUM(O10:O11)","v":211777.30189999999},{"$f":"SUM(P10:P11)","v":2300000},{"$f":"ROUND(P9-SUMIF('1_Původní'!A:A,'2_Upravený'!A9,'1_Původní'!P:P),0)","v":0}]
[null,"9003","Etická komise",132976.4454,167451.82010000001,201927.1949,211777.30189999999,226552.46249999999,132976.4454,216702.35550000001,197002.14129999999,128051.3919,221627.40900000001,251177.73019999999,211777.30189999999,{"$f":"SUM(D10:O10)","v":2300000},{"$f":"IF(AND(ROUND(P10,0)<>0,B10=\"\"),\"Obrat bez specifikace NS\",\"\")","v":""},null,"Orig",{"$f":"$A$5","v":64908009}]
[null,"",{"$f":"IFERROR(VLOOKUP(B11,CisNS!$A:$B,2,FALSE),\"\")","v":""},null,null,null,null,null,null,null,null,null,null,null,null,0,"",null,null,{"$f":"T10","v":64908009},"End"]
[]
[64924439,"Klinické hodnocení - tuzemci (81xx,9003,9028)",null,{"$f":"SUM(D14:D27)","v":885232.74040000001},{"$f":"SUM(E14:E27)","v":3562594.5710999998},{"$f":"SUM(F14:F27)","v":4268226.5504000001},{"$f":"SUM(G14:G27)","v":4238089.1201999998},{"$f":"SUM(H14:H27)","v":717306.03979999991},{"$f":"SUM(I14:I27)","v":1511824.4939000001},{"$f":"SUM(J14:J27)","v":2377216.6298000002},{"$f":"SUM(K14:K27)","v":6585884.6924999999},{"$f":"SUM(L14:L27)","v":532703.81389999995},{"$f":"SUM(M14:M27)","v":1037839.029},{"$f":"SUM(N14:N27)","v":4967132.5790000008},{"$f":"SUM(O14:O27)","v":4515949.7396999998},{"$f":"SUM(P14:P27)","v":35199999.999700002},{"$f":"ROUND(P13-SUMIF('1_Původní'!A:A,'2_Upravený'!A13,'1_Původní'!P:P),0)","v":0}]
[null,"8101","Klinická hodnocení - I. Interní klinika",0,0,129639.2115,0,0,0,5744.6608999999999,0,0,0,226408.97270000001,0,{"$f":"SUM(D14:O14)","v":361792.84510000004},{"$f":"IF(AND(ROUND(P14,0)<>0,B14=\"\"),\"Obrat bez specifikace NS\",\"\")","v":""},null,"Orig",{"$f":"$A$13","v":64924439}]
[null,"8103","Klinická hodnocení - III. Interní klinika",0,0,0,0,0,0,30283.304,0,0,0,21980.143700000001,0,{"$f":"SUM(D15:O15)","v":52263.447700000004},{"$f":"IF(AND(ROUND(P15,0)<>0,B15=\"\"),\"Obrat bez specifikace NS\",\"\")","v":""},null,"Orig",{"$f":"$A$13","v":64924439}]
[null,"8108","Klinická hodnocení - Porodnicko-gynekologická klinika",0,0,0,0,0,0,0,17581.436099999999,0,0,0,0,17581.436099999999,"",null,"Orig",64924439]
[null,"8112","Klinická hodnocení - Urologická klinika",0,27662.387999999999,0,0,0,0,15097.352699999999,0,0,0,0,0,42759.740699999995,"",null,"Orig",64924439]
[null,"8114","Klinická hodnocení - Oční klinika",0,93049.482099999994,0,49657.914400000001,0,0,0,0,0,0,110076.2138,0,252783.6103,"",null,"Orig",64924439]
[null,"8116","Klinická hodnocení - Klinika plicních nemocí a tuberkulózy",28262.333500000001,147491.52929999999,0,119281.0156,0,26378.739799999999,0,7621.5784000000003,281574.94069999998,1098.7629999999999,46721.133600000001,11684.6994,670114.73329999996,"",null,"Orig",64924439]
[null,"8117","Klinická hodnocení - Neurologická klinika",17382.556499999999,0,25872.039100000002,84926.274799999999,11163.1741,199898.75810000001,46700.442000000003,0,0,11856.427299999999,9636.3261000000002,283711.17320000002,691147.17119999998,"",null,"Orig",64924439]
{"$rows_left_out":228}
{"sheet":"3_Rozdíly","index":4,"n_rows":247,"n_cols":16,"rows_kept":247,"cut":false,"hidden":true,"merged":[]}
["Legenda",null,"Hodnoty v CZK"]
["Účet","Název účtu"]
[null,"NS","Název NS",{"$f":"MID(Summary!$B$2,18,4)&\"01\"","v":"202101"},{"$f":"MID(Summary!$B$2,18,4)&\"02\"","v":"202102"},{"$f":"MID(Summary!$B$2,18,4)&\"03\"","v":"202103"},{"$f":"MID(Summary!$B$2,18,4)&\"04\"","v":"202104"},{"$f":"MID(Summary!$B$2,18,4)&\"05\"","v":"202105"},{"$f":"MID(Summary!$B$2,18,4)&\"06\"","v":"202106"},{"$f":"MID(Summary!$B$2,18,4)&\"07\"","v":"202107"},{"$f":"MID(Summary!$B$2,18,4)&\"08\"","v":"202108"},{"$f":"MID(Summary!$B$2,18,4)&\"09\"","v":"202109"},{"$f":"MID(Summary!$B$2,18,4)&\"10\"","v":"202110"},{"$f":"MID(Summary!$B$2,18,4)&\"11\"","v":"202111"},{"$f":"MID(Summary!$B$2,18,4)&\"12\"","v":"202112"},{"$f":"MID(Summary!$B$2,18,4)&\" celkem\"","v":"2021 celkem"}]
[]
[64908009,"Smlouva o účelově vázané úplatě",null,{"$f":"SUM(D7:D7)","v":0},0,0,0,0,0,0,0,0,0,0,0,0]
[null,{"$f":"IF('2_Upravený'!B6=\"\",\"\",'2_Upravený'!B6)","v":"4803"},{"$f":"IF('2_Upravený'!C6=\"\",\"\",'2_Upravený'!C6)","v":"OP - specializační vzdělávání klinických farmaceutů"},{"$f":"'2_Upravený'!D6-'1_Původní'!D6","v":0},{"$f":"'2_Upravený'!E6-'1_Původní'!E6","v":0},{"$f":"'2_Upravený'!F6-'1_Původní'!F6","v":0},{"$f":"'2_Upravený'!G6-'1_Původní'!G6","v":0},{"$f":"'2_Upravený'!H6-'1_Původní'!H6","v":0},{"$f":"'2_Upravený'!I6-'1_Původní'!I6","v":0},{"$f":"'2_Upravený'!J6-'1_Původní'!J6","v":0},{"$f":"'2_Upravený'!K6-'1_Původní'!K6","v":0},{"$f":"'2_Upravený'!L6-'1_Původní'!L6","v":0},{"$f":"'2_Upravený'!M6-'1_Původní'!M6","v":0},{"$f":"'2_Upravený'!N6-'1_Původní'!N6","v":0},{"$f":"'2_Upravený'!O6-'1_Původní'!O6","v":0},{"$f":"SUM(D6:O6)","v":0}]
[null,{"$f":"IF('2_Upravený'!B7=\"\",\"\",'2_Upravený'!B7)","v":""},{"$f":"IF('2_Upravený'!C7=\"\",\"\",'2_Upravený'!C7)","v":""},{"$f":"'2_Upravený'!D7-'1_Původní'!D7","v":0},{"$f":"'2_Upravený'!E7-'1_Původní'!E7","v":0},{"$f":"'2_Upravený'!F7-'1_Původní'!F7","v":0},{"$f":"'2_Upravený'!G7-'1_Původní'!G7","v":0},{"$f":"'2_Upravený'!H7-'1_Původní'!H7","v":0},{"$f":"'2_Upravený'!I7-'1_Původní'!I7","v":0},{"$f":"'2_Upravený'!J7-'1_Původní'!J7","v":0},{"$f":"'2_Upravený'!K7-'1_Původní'!K7","v":0},{"$f":"'2_Upravený'!L7-'1_Původní'!L7","v":0},{"$f":"'2_Upravený'!M7-'1_Původní'!M7","v":0},{"$f":"'2_Upravený'!N7-'1_Původní'!N7","v":0},{"$f":"'2_Upravený'!O7-'1_Původní'!O7","v":0},{"$f":"SUM(D7:O7)","v":0}]
[]
[64924438,"Výkony etické komise",null,{"$f":"SUM(D11:D11)","v":0},0,0,0,0,0,0,0,0,0,0,0,0]
[null,{"$f":"IF('2_Upravený'!B10=\"\",\"\",'2_Upravený'!B10)","v":"9003"},{"$f":"IF('2_Upravený'!C10=\"\",\"\",'2_Upravený'!C10)","v":"Etická komise"},{"$f":"'2_Upravený'!D10-'1_Původní'!D10","v":0},{"$f":"'2_Upravený'!E10-'1_Původní'!E10","v":0},{"$f":"'2_Upravený'!F10-'1_Původní'!F10","v":0},{"$f":"'2_Upravený'!G10-'1_Původní'!G10","v":0},{"$f":"'2_Upravený'!H10-'1_Původní'!H10","v":0},{"$f":"'2_Upravený'!I10-'1_Původní'!I10","v":0},{"$f":"'2_Upravený'!J10-'1_Původní'!J10","v":0},{"$f":"'2_Upravený'!K10-'1_Původní'!K10","v":0},{"$f":"'2_Upravený'!L10-'1_Původní'!L10","v":0},{"$f":"'2_Upravený'!M10-'1_Původní'!M10","v":0},{"$f":"'2_Upravený'!N10-'1_Původní'!N10","v":0},{"$f":"'2_Upravený'!O10-'1_Původní'!O10","v":0},{"$f":"SUM(D10:O10)","v":0}]
[null,{"$f":"IF('2_Upravený'!B11=\"\",\"\",'2_Upravený'!B11)","v":""},{"$f":"IF('2_Upravený'!C11=\"\",\"\",'2_Upravený'!C11)","v":""},{"$f":"'2_Upravený'!D11-'1_Původní'!D11","v":0},{"$f":"'2_Upravený'!E11-'1_Původní'!E11","v":0},{"$f":"'2_Upravený'!F11-'1_Původní'!F11","v":0},{"$f":"'2_Upravený'!G11-'1_Původní'!G11","v":0},{"$f":"'2_Upravený'!H11-'1_Původní'!H11","v":0},{"$f":"'2_Upravený'!I11-'1_Původní'!I11","v":0},{"$f":"'2_Upravený'!J11-'1_Původní'!J11","v":0},{"$f":"'2_Upravený'!K11-'1_Původní'!K11","v":0},{"$f":"'2_Upravený'!L11-'1_Původní'!L11","v":0},{"$f":"'2_Upravený'!M11-'1_Původní'!M11","v":0},{"$f":"'2_Upravený'!N11-'1_Původní'!N11","v":0},{"$f":"'2_Upravený'!O11-'1_Původní'!O11","v":0},0]
[]
[64924439,"Klinické hodnocení - tuzemci (81xx,9003,9028)",null,{"$f":"SUM(D27:D27)","v":0},0,0,0,0,0,0,0,0,0,0,0,0]
[null,{"$f":"IF('2_Upravený'!B14=\"\",\"\",'2_Upravený'!B14)","v":"8101"},{"$f":"IF('2_Upravený'!C14=\"\",\"\",'2_Upravený'!C14)","v":"Klinická hodnocení - I. Interní klinika"},{"$f":"'2_Upravený'!D14-'1_Původní'!D14","v":0},{"$f":"'2_Upravený'!E14-'1_Původní'!E14","v":0},{"$f":"'2_Upravený'!F14-'1_Původní'!F14","v":0},{"$f":"'2_Upravený'!G14-'1_Původní'!G14","v":0},{"$f":"'2_Upravený'!H14-'1_Původní'!H14","v":0},{"$f":"'2_Upravený'!I14-'1_Původní'!I14","v":0},{"$f":"'2_Upravený'!J14-'1_Původní'!J14","v":0},{"$f":"'2_Upravený'!K14-'1_Původní'!K14","v":0},{"$f":"'2_Upravený'!L14-'1_Původní'!L14","v":0},{"$f":"'2_Upravený'!M14-'1_Původní'!M14","v":0},{"$f":"'2_Upravený'!N14-'1_Původní'!N14","v":0},{"$f":"'2_Upravený'!O14-'1_Původní'!O14","v":0},{"$f":"SUM(D14:O14)","v":0}]
[null,{"$f":"IF('2_Upravený'!B15=\"\",\"\",'2_Upravený'!B15)","v":"8103"},{"$f":"IF('2_Upravený'!C15=\"\",\"\",'2_Upravený'!C15)","v":"Klinická hodnocení - III. Interní klinika"},{"$f":"'2_Upravený'!D15-'1_Původní'!D15","v":0},{"$f":"'2_Upravený'!E15-'1_Původní'!E15","v":0},{"$f":"'2_Upravený'!F15-'1_Původní'!F15","v":0},{"$f":"'2_Upravený'!G15-'1_Původní'!G15","v":0},{"$f":"'2_Upravený'!H15-'1_Původní'!H15","v":0},{"$f":"'2_Upravený'!I15-'1_Původní'!I15","v":0},{"$f":"'2_Upravený'!J15-'1_Původní'!J15","v":0},{"$f":"'2_Upravený'!K15-'1_Původní'!K15","v":0},{"$f":"'2_Upravený'!L15-'1_Původní'!L15","v":0},{"$f":"'2_Upravený'!M15-'1_Původní'!M15","v":0},{"$f":"'2_Upravený'!N15-'1_Původní'!N15","v":0},{"$f":"'2_Upravený'!O15-'1_Původní'!O15","v":0},{"$f":"SUM(D15:O15)","v":0}]
[null,{"$f":"IF('2_Upravený'!B16=\"\",\"\",'2_Upravený'!B16)","v":"8108"},{"$f":"IF('2_Upravený'!C16=\"\",\"\",'2_Upravený'!C16)","v":"Klinická hodnocení - Porodnicko-gynekologická klinika"},{"$f":"'2_Upravený'!D16-'1_Původní'!D16","v":0},{"$f":"'2_Upravený'!E16-'1_Původní'!E16","v":0},{"$f":"'2_Upravený'!F16-'1_Původní'!F16","v":0},{"$f":"'2_Upravený'!G16-'1_Původní'!G16","v":0},{"$f":"'2_Upravený'!H16-'1_Původní'!H16","v":0},{"$f":"'2_Upravený'!I16-'1_Původní'!I16","v":0},{"$f":"'2_Upravený'!J16-'1_Původní'!J16","v":0},{"$f":"'2_Upravený'!K16-'1_Původní'!K16","v":0},{"$f":"'2_Upravený'!L16-'1_Původní'!L16","v":0},{"$f":"'2_Upravený'!M16-'1_Původní'!M16","v":0},{"$f":"'2_Upravený'!N16-'1_Původní'!N16","v":0},{"$f":"'2_Upravený'!O16-'1_Původní'!O16","v":0},0]
[null,{"$f":"IF('2_Upravený'!B17=\"\",\"\",'2_Upravený'!B17)","v":"8112"},{"$f":"IF('2_Upravený'!C17=\"\",\"\",'2_Upravený'!C17)","v":"Klinická hodnocení - Urologická klinika"},{"$f":"'2_Upravený'!D17-'1_Původní'!D17","v":0},{"$f":"'2_Upravený'!E17-'1_Původní'!E17","v":0},{"$f":"'2_Upravený'!F17-'1_Původní'!F17","v":0},{"$f":"'2_Upravený'!G17-'1_Původní'!G17","v":0},{"$f":"'2_Upravený'!H17-'1_Původní'!H17","v":0},{"$f":"'2_Upravený'!I17-'1_Původní'!I17","v":0},{"$f":"'2_Upravený'!J17-'1_Původní'!J17","v":0},{"$f":"'2_Upravený'!K17-'1_Původní'!K17","v":0},{"$f":"'2_Upravený'!L17-'1_Původní'!L17","v":0},{"$f":"'2_Upravený'!M17-'1_Původní'!M17","v":0},{"$f":"'2_Upravený'!N17-'1_Původní'!N17","v":0},{"$f":"'2_Upravený'!O17-'1_Původní'!O17","v":0},0]
[null,{"$f":"IF('2_Upravený'!B18=\"\",\"\",'2_Upravený'!B18)","v":"8114"},{"$f":"IF('2_Upravený'!C18=\"\",\"\",'2_Upravený'!C18)","v":"Klinická hodnocení - Oční klinika"},{"$f":"'2_Upravený'!D18-'1_Původní'!D18","v":0},{"$f":"'2_Upravený'!E18-'1_Původní'!E18","v":0},{"$f":"'2_Upravený'!F18-'1_Původní'!F18","v":0},{"$f":"'2_Upravený'!G18-'1_Původní'!G18","v":0},{"$f":"'2_Upravený'!H18-'1_Původní'!H18","v":0},{"$f":"'2_Upravený'!I18-'1_Původní'!I18","v":0},{"$f":"'2_Upravený'!J18-'1_Původní'!J18","v":0},{"$f":"'2_Upravený'!K18-'1_Původní'!K18","v":0},{"$f":"'2_Upravený'!L18-'1_Původní'!L18","v":0},{"$f":"'2_Upravený'!M18-'1_Původní'!M18","v":0},{"$f":"'2_Upravený'!N18-'1_Původní'!N18","v":0},{"$f":"'2_Upravený'!O18-'1_Původní'!O18","v":0},0]
[null,{"$f":"IF('2_Upravený'!B19=\"\",\"\",'2_Upravený'!B19)","v":"8116"},{"$f":"IF('2_Upravený'!C19=\"\",\"\",'2_Upravený'!C19)","v":"Klinická hodnocení - Klinika plicních nemocí a tuberkulózy"},{"$f":"'2_Upravený'!D19-'1_Původní'!D19","v":0},{"$f":"'2_Upravený'!E19-'1_Původní'!E19","v":0},{"$f":"'2_Upravený'!F19-'1_Původní'!F19","v":0},{"$f":"'2_Upravený'!G19-'1_Původní'!G19","v":0},{"$f":"'2_Upravený'!H19-'1_Původní'!H19","v":0},{"$f":"'2_Upravený'!I19-'1_Původní'!I19","v":0},{"$f":"'2_Upravený'!J19-'1_Původní'!J19","v":0},{"$f":"'2_Upravený'!K19-'1_Původní'!K19","v":0},{"$f":"'2_Upravený'!L19-'1_Původní'!L19","v":0},{"$f":"'2_Upravený'!M19-'1_Původní'!M19","v":0},{"$f":"'2_Upravený'!N19-'1_Původní'!N19","v":0},{"$f":"'2_Upravený'!O19-'1_Původní'!O19","v":0},0]
[null,{"$f":"IF('2_Upravený'!B20=\"\",\"\",'2_Upravený'!B20)","v":"8117"},{"$f":"IF('2_Upravený'!C20=\"\",\"\",'2_Upravený'!C20)","v":"Klinická hodnocení - Neurologická klinika"},{"$f":"'2_Upravený'!D20-'1_Původní'!D20","v":0},{"$f":"'2_Upravený'!E20-'1_Původní'!E20","v":0},{"$f":"'2_Upravený'!F20-'1_Původní'!F20","v":0},{"$f":"'2_Upravený'!G20-'1_Původní'!G20","v":0},{"$f":"'2_Upravený'!H20-'1_Původní'!H20","v":0},{"$f":"'2_Upravený'!I20-'1_Původní'!I20","v":0},{"$f":"'2_Upravený'!J20-'1_Původní'!J20","v":0},{"$f":"'2_Upravený'!K20-'1_Původní'!K20","v":0},{"$f":"'2_Upravený'!L20-'1_Původní'!L20","v":0},{"$f":"'2_Upravený'!M20-'1_Původní'!M20","v":0},{"$f":"'2_Upravený'!N20-'1_Původní'!N20","v":0},{"$f":"'2_Upravený'!O20-'1_Původní'!O20","v":0},0]
{"$rows_left_out":228}
{"sheet":"CisNS","index":5,"n_rows":1042,"n_cols":2,"rows_kept":1042,"cut":false,"hidden":true,"merged":[]}
["pracv","pracvt"]
["0101","Vedení klinického pracoviště"]
["0102",""]
["0103",""]
["0104","OP - Interaktivní kardiologie-moderní výukové metody"]
["0107","IOP- Mod.obn.přistr.vyb.komplex.kardiovas.centra"]
["0111","Lůžkové oddělení 1 "]
["0112","Lůžkové oddělení"]
["0113","Lůžkové oddělení 4 "]
["0115","Lůžkové oddělení ECMO"]
["0116","Lůžkové oddělení COVID 19"]
["0117","1IK: lůžkové oddělení"]
["0121","Ambulance"]
["0122","Ambulance - PAH "]
["0123","Ambulance"]
["0124","Ambulance"]
["0131","JIP "]
["0171","Odd. invaz. vyš. metod-kardiovertery"]
["0172","Katetrizační sál"]
["0176","IROP - Návazná péče"]
{"$rows_left_out":1022}